Home > command not > make cc command not found error 127

Make Cc Command Not Found Error 127

communities company blog Stack Exchange Inbox Reputation and Badges sign up log in tour help Tour Start here for a quick overview of the site Help Center Detailed answers to any questions you make error 127 linux might have Meta Discuss the workings and policies of this site About

Make Error 127 Ubuntu

Us Learn more about Stack Overflow the company Business Learn more about hiring developers or posting ads

Makefile Error 127 Command Not Found

with us Ask Ubuntu Questions Tags Users Badges Unanswered Ask Question _ Ask Ubuntu is a question and answer site for Ubuntu users and developers. Join them; it

Cc: Command Not Found Centos

only takes a minute: Sign up Here's how it works: Anybody can ask a question Anybody can answer The best answers are voted up and rise to the top /bin/bash: g++: command not found error 127 up vote 2 down vote favorite I was trying to install a software quicknet from a tar.gz file. After using make cc command not found ubuntu ./configure when i tried using make it showed the following erroe g++ -I. -I. -c QN_args.cc /bin/bash: g++: command not found make: *** [QN_args.o] Error 127 i have already installed gcc compiler i am new to Ubuntu and Linux any help will be appreciated thanks in advance command-line bash compiling gcc share|improve this question edited Feb 8 '15 at 18:19 muru 69.1k12125176 asked Feb 8 '15 at 18:08 Jasmeen Patel 16112 add a comment| 1 Answer 1 active oldest votes up vote 5 down vote You need the g++ compiler, not the gcc, so install the g++ package, and maybe build-essential for any needed headers: sudo apt-get install g++ and if necessary (probably not for this package): sudo apt-get install build-essential You should read the README file(s), then the INSTALL file and follow the instructions. They usually boil down to run configure: ./configure then run make: make and if you want to install the programs in a system area, run: sudo make install The configure step should se

communities company blog Stack Exchange Inbox Reputation and Badges sign up log in tour help Tour Start here for a quick overview of the site Help Center Detailed answers to any questions you might have Meta Discuss the workings and policies of this site About Us Learn more error 127 makefile about Stack Overflow the company Business Learn more about hiring developers or posting ads make error 127 command not found with us Ask Ubuntu Questions Tags Users Badges Unanswered Ask Question _ Ask Ubuntu is a question and answer site for cc command not found mingw Ubuntu users and developers. Join them; it only takes a minute: Sign up Here's how it works: Anybody can ask a question Anybody can answer The best answers are voted up and rise to the http://askubuntu.com/questions/583171/bin-bash-g-command-not-found-error-127 top How do you fix a gcc compile 127 error? sudo apt-get install g++ doesn't work up vote 2 down vote favorite 1 *emphasized text*when I try to run a program I get the following error. ubuntu@ubuntu-VirtualBox:~/Desktop$ make g++ -Wall -Wno-switch -I. -g -c -o pass.o pass.cpp make: g++: Command not found make: *** [pass.o] Error 127 I couldn't get gcc 4.8.2 installed because it said it couldn't find it. I http://askubuntu.com/questions/448691/how-do-you-fix-a-gcc-compile-127-error-sudo-apt-get-install-g-doesnt-work did install 4.8 I did the following to install gcc sudo add-apt-repository ppa:ubuntu-toolchain-f/test sudo apt-get update sudo apt-get install gcc-4.8 next I did sudo update-alternatives --install /usr/bin/gcc gcc /usr/bin/gcc-4.6 60 --slave /usr/bin/g++ g++ /usr/bin/g++-4.6 sudo update-alternatives --install /usr/bin/gcc gcc /usr/bin/gcc-4.8 40 --slave /usr/bin/g++ g++ /usr/bin/g++-4.8 sudo update-alternatives --config gcc the only thing I can think of is I don't have 4.8 when I type the command gcc -v it says gcc version 4.8.1 (Ubuntu 4.8.1-2ubuntu1~12.04) ok I run: ubuntu@ubuntu-VirtualBox:~$ sudo apt-get install g++ Reading package lists... Done Building dependency tree Reading state information... Done g++ is already the newest version. g++ set to manually installed. The following package was automatically installed and is no longer required: thunderbird-globalmenu Use 'apt-get autoremove' to remove them. 0 upgraded, 0 newly installed, 0 to remove and 293 not upgraded. ubuntu@ubuntu-VirtualBox:~$ g++ -v The program 'g++' can be found in the following packages: * g++ * pentium-builder Try: sudo apt-get install ubuntu@ubuntu-VirtualBox:~/Desktop$ g++ --help | grep version The program 'g++' can be found in the following packages: * g++ * pentium-builder Try: sudo apt-get install ubuntu@ubuntu-VirtualBox:~/Desktop$ g++ --version The program 'g++' can be found in the following packages: * g++ * pentium-builder Try: sudo apt-get install ubuntu@ubuntu-VirtualBox:~/Desktop$ ^C

Error: 127 If this is your first visit, be sure to check out the FAQ by clicking the link above. You may have to register before you can post: click the register link above to proceed. To start viewing messages, select the forum that http://www.qtcentre.org/threads/6928-make-command-not-found-Error-127 you want to visit from the selection below. Welcome to Qt Centre. Qt Centre is a community site devoted to programming in C++ using the Qt framework. Over 90 percent of questions asked here gets answered. If you are http://www.centos.org/forums/viewtopic.php?t=17507 looking for information about Qt related issue — register and post your question. You are currently viewing our boards as a guest which gives you limited access to view most discussions and access our other features. By joining our free command not community you will have access to post topics, communicate privately with other members (PM), respond to polls, upload content and access many other special features. Registration is fast, simple and absolutely free so please, join our community today! If you have any problems with the registration process or your account login, please contact us. + Reply to Thread Results 1 to 4 of 4 Thread: make: command not found, Error: 127 Thread Tools Show Printable Version Subscribe to this Thread… command not found Search Thread Advanced Search Display Linear Mode Switch to Hybrid Mode Switch to Threaded Mode 9th May 2007,05:41 #1 ct View Profile View Forum Posts View Blog Entries View Articles Intermediate user Join Date Feb 2006 Posts 91 Thanks 4 Qt products Platforms make: command not found, Error: 127 : command not found make: *** [appname] Error 127 I am using a linux box and the same makefile and the srcs work in my local computer as root, but when I try to upload it to a server then I get this error for that particular set of sources, its a CGI application in C. Other similar makefiles work like charm and I am having problem with this particular folder only. Applying my commonsense I did chmod -R 777 srcfolder but this didn't help I keep getting the error. I can use gcc,g++ and plld a front-end compiler and linker of C-files for prolog from the command line so there isn't much problem int that.The very thing that is amusing me is that a similar makefile in other directory under the same username works like a charm. Aggghhhh...I am getting frustrated.. here is the makefile if it is due to any error on this one #/////////////////////////////////////////////////////////////////////// # This makefile generates the final executable to be used as cgi # from C/C++ and Prolog source files. The output is is stored in ../bin # directory. # add

ALFA Network driver General support questions including new installations Post Reply Print view Search Advanced search 13 posts 1 2 Next CardScape Posts: 6 Joined: 2011/06/22 23:13:32 Contact: Contact CardScape Website [Problem] Compiling/Installing ALFA Network driver Quote Postby CardScape » 2011/06/22 23:22:09 Hi,I've just installed CentOS in my PC - removed win 7.and i have a problem in driver installingthese are the commands :Code: Select allmake
make install
log :Code: Select all[CardScape@cardscape ~]$ dir
Desktop
rtl8187L_linux_26.1039.0104.2010.release
rtl8187L_linux_26.1039.0104.2010.release.tar.gz

[CardScape@cardscape ~]$ cd rtl8187L_linux_26.1039.0104.2010.release

[CardScape@cardscape rtl8187L_linux_26.1039.0104.2010.release]$ sudo make
/usr/src/kernels/2.6.18-238.el5-PAE-i686/scripts/gcc-version.sh: line 11: gcc: command not found

/usr/src/kernels/2.6.18-238.el5-PAE-i686/scripts/gcc-version.sh: line 12: gcc: command not found

make[1]: gcc: Command not found

make[1]: Entering directory `/usr/src/kernels/2.6.18-238.el5-PAE-i686'

CC [M] /home/CardScape/rtl8187L_linux_26.1039.0104.2010.release/rtl8187/r8187_core.o

/bin/sh: gcc: command not found

make[2]: *** [/home/CardScape/rtl8187L_linux_26.1039.0104.2010.release/rtl8187/r8187_core.o] Error 127

make[1]: *** [_module_/home/CardScape/rtl8187L_linux_26.1039.0104.2010.release/rtl8187] Error 2

make[1]: Leaving directory `/usr/src/kernels/2.6.18-238.el5-PAE-i686'

make: *** [all] Error 2

[CardScape@cardscape rtl8187L_linux_26.1039.0104.2010.release]$ sudo make install

/lib/modules/2.6.18-238.el5PAE/kernel/drivers/net/wireless/rtl818x/rtl8187.ko: \
/lib/modules/2.6.18-238.el5PAE/kernel/net/mac80211/mac80211.ko \
/lib/modules/2.6.18-238.el5PAE/kernel/net/wireless/cfg80211.ko \
/lib/modules/2.6.18-238.el5PAE/kernel/net/rfkill/rfkill.ko \
/lib/modules/2.6.18-238.el5PAE/kernel/net/wireless/wireless_compat.ko \

 

Related content

command not found unix error

command not found unix error p FreeBSD Linux UNIXWhy I am getting the error Command not found How do I fix this problem A common question asked by new Linux or UNIX users When you get the error Command not sqlplus command not found in unix found it means that Linux or UNIX searched for command everywhere it knew to sqlplus command not found in unix shell script look and could not find a program by that name Another cause is you misspelled the command name typo or Spawn Command Not Found In Unix administrator does not at all install

command not found error

command not found error p communities company blog Stack Exchange Inbox Reputation and Badges sign up log in tour help Tour Start here for a quick overview of the site Help Center Detailed answers to any questions you might have Meta Discuss the workings and policies of this site About Us Learn more about Stack Overflow the company Business Learn more command not found error in shell script about hiring developers or posting ads with us Ask Ubuntu Questions Tags Users Badges Unanswered Ask Command Not Found Error Question Ask Ubuntu is a question and answer site for Ubuntu users

cygwin error bash make command not found

cygwin error bash make command not found p here for a quick overview of the site Help Center Detailed answers to any questions you might have Meta Discuss the workings and policies of this site About Us Learn more about Stack Overflow the company Business cygwin bash ls command not found Learn more about hiring developers or posting ads with us Stack Overflow Questions Jobs Documentation Bash Gcc Command Not Found Cygwin Tags Users Badges Ask Question x Dismiss Join the Stack Overflow Community Stack Overflow is a community of million programmers just cygwin remove like you helping each other

bluez-simple-agent org.bluez.error. alreadyexists

bluez-simple-agent org bluez error alreadyexists p Board index The team Delete all board cookies All times are UTC div p p here for a quick overview of the site Help Dbus exceptions dbusexception Org bluez error nosuchadapter No Such Adapter Center Detailed answers to any questions you might have org bluez error doesnotexist does not exist Meta Discuss the workings and policies of this site About Us Learn more about Stack bluetoothctl remove device Overflow the company Business Learn more about hiring developers or posting ads with us Stack Overflow Questions Jobs Documentation Tags Users Badges Ask a href https

doxygen error problems running epstopdf. check your tex installation

doxygen error problems running epstopdf check your tex installation p instructions Windows Mac Red Hat Linux Ubuntu Click URL instructions Right-click on ad choose Copy Link then paste here rarr This may not be possible with some types of ads More information about our Doxygen Epstopdf Command Not Found ad policies X You seem to have CSS turned off Please don't fill sh epstopdf command not found out this field You seem to have CSS turned off Please don't fill out this field Briefly describe the problem Miktex required Upload screenshot of ad required Select a file or drag drop

epstopdf doxygen error

epstopdf doxygen error p SCAP-on-Apple SmartCard Services WebKit XQuartz Contact Terms of Use Privacy Policy All user-submitted text and content on this website is licensed under a Creative Commons Attribution License doxygen epstopdf command not found unless otherwise noted Copyright Apple Inc All rights reserved New Sh Epstopdf Command Not Found Ticket Tickets Wiki Browse Source Timeline Roadmap Miktex Ticket Reports Search Search Context Navigation larr Previous TicketNext Ticket rarr Ticket new defect Opened months ago Last modified months ago doxygen sh epstopdf command not found Reported by wahspilihp Owned by css Priority Normal Milestone Component ports Version Keywords Cc

error /bin/sh xgettext command not found

error bin sh xgettext command not found p here for a quick overview of the site Help Center Detailed answers to any questions you might have Meta Discuss the Msguniq Command Not Found workings and policies of this site About Us Learn more about Stack msguniq windows Overflow the company Business Learn more about hiring developers or posting ads with us Stack Overflow Questions Jobs Install Gettext Mac Documentation Tags Users Badges Ask Question x Dismiss Join the Stack Overflow Community Stack Overflow is a community of million programmers just like you helping each other Join them brew install gettext

5 - yacc error reconnect

- yacc error reconnect p Support Search GitHub This repository Watch yacc error recovery Star Fork krakjoe jitfu Code Issues Pull Yacc Error Handling requests Projects Pulse Graphs New issue Installation problems - yacc and yacc command not found ubuntu syntax error Closed Swader opened this Issue Sep middot comments Projects None yet Labels None yet Milestone No Install Yacc Ubuntu milestone Assignees No one assigned participants Swader commented Sep During installation I was first told yacc command not found This was fixed by installing byacc Then I got this after re-running make vagrant homestead Code libijt-fu make cd bin

501 cannot exec command line error=2

cannot exec command line error p here for a quick overview of the site Help Center Detailed answers to any questions you might have Meta Discuss the workings and policies of this site About Us Learn Bash Command Not Found Linux more about Stack Overflow the company Business Learn more about hiring developers or command not found bash script posting ads with us Stack Overflow Questions Jobs Documentation Tags Users Badges Ask Question x Dismiss Join the Stack Overflow bash command not found variable Community Stack Overflow is a community of million programmers just like you helping each other Join

502 5.5.2 error

error p Start here for a quick overview of the site Help Center Detailed answers to any questions you might have Meta Discuss the Telnet Error Command Not Recognized workings and policies of this site About Us Learn more about Stack postfix ehlo error command not recognized Overflow the company Business Learn more about hiring developers or posting ads with us Server Fault Questions Tags ehlo command not recognized Users Badges Unanswered Ask Question Server Fault is a question and answer site for system and network administrators Join them it only takes a minute Sign up Here's Smtp Data Command

502 error command not implemented

error command not implemented p be down Please try the request again Your cache administrator is webmaster Generated Thu Sep GMT by s hv squid p p EditionsStandard EditionProfessional EditionEnterprise EditionEnterprise PremiumFeature MatrixWebmail DemoVideo GalleryMigrate To MailEnableTestimonialsPurchasePricingUpgradesPurchaseLicensingDownloadsProductsTools UtilitiesDiagnostic ResourcesMigration ConversionManagement UtilitiesContent Spam FilteringApplication ExtensionsBeta ReleasesSupportSupport OverviewKnowledge BaseDocumentationDiscussion ForumRaise Ffftp Command Not Implemented Support TicketSystem RequirementsOnline Diagnostic UtilitiesDevelopersGeneralResourcesPartnersResellersServicesHostingControl PanelIntegrationBecome a pasv command not implemented ResellerCompanyAnnouncementsContact UsTechnical SupportRaise SuggestionMedia Downloads ME - INF SMTP Connector Inbound Response Codes bad sequence of commands outlook SUMMARY This article describes the various SMTP returncodes that senders may receive when communicating with the SMTP service a

apachectl command not found error

apachectl command not found error p Start here for a quick overview of the site Help Center Detailed answers to any questions you might have error invoking apachectl start command Meta Discuss the workings and policies of this site About Us apachectl command not found mac Learn more about Stack Overflow the company Business Learn more about hiring developers or posting ads with Bash Apachectl Command Not Found us Server Fault Questions Tags Users Badges Unanswered Ask Question Server Fault is a question and answer site for system and network administrators Join them it only Linux Apachectl takes a minute

assp smtp error 502 5.5.2 error command not recognized

assp smtp error error command not recognized p clean Screenshot instructions Windows Mac Red Hat Linux Ubuntu Click URL instructions Right-click on ad choose Smtp Error Command Not Recognized Copy Link then paste here rarr This may not be postfix ehlo error command not recognized possible with some types of ads More information about our ad policies X You seem telnet error command not recognized to have CSS turned off Please don't fill out this field You seem to have CSS turned off Please don't fill out this field Command Not Implemented Briefly describe the problem required Upload screenshot of

auth login 502 5.5.2 error command not recognized

auth login error command not recognized p Support Search GitHub This repository Watch Star Fork PHPMailer PHPMailer Code Issues Pull requests Projects error command not recognized postfix Wiki Pulse Graphs New issue SMTP Auth error with Exchange server postfix ehlo error command not recognized Closed webbird opened this Issue Aug middot comments Projects None yet Labels None telnet error command not recognized yet Milestone No milestone Assignees No one assigned participants webbird commented Aug I have a strange problem with sending mails via SMTP with authentication using an Ehlo Command Not Recognized Exchange Server The Debug gave me this CLIENT

bash error command not found

bash error command not found p Tutorials Articles Search HCL Search Reviews Search ISOs Go to Page LinuxQuestions org Forums Linux Forums Linux - General Bash command not found User Name Remember Me Password Linux - General This Linux forum is for general shell command not found Linux questions and discussion If it is Linux Related and doesn't seem to fit in Bash Command Function any other forum then this is the place Notices Welcome to LinuxQuestions org a friendly and active Linux Community You are currently viewing LQ linux command not found bash as a guest By joining our

bash error handling command not found

bash error handling command not found p here for a quick overview of the site Help Center Detailed answers to any questions you might have Meta Discuss the workings and bash error handling best practices policies of this site About Us Learn more about Stack Overflow the company Error Handling In Bash Shell Script Business Learn more about hiring developers or posting ads with us Unix Linux Questions Tags Users Badges Unanswered bash throw error Ask Question Unix Linux Stack Exchange is a question and answer site for users of Linux FreeBSD and other Un x-like operating systems Join them

bash ns command not found error

bash ns command not found error p HCL Search Reviews Search ISOs Go to Page LinuxQuestions org Forums Linux Forums Linux - Software bash ns bash ns command not found using ns- User Name Remember Me Password Linux Ns Command - Software This forum is for Software issues Having a problem installing a new program Want to bash ns command not found cygwin know which application is best for the job Post your question in this forum Notices Welcome to LinuxQuestions org a friendly and active Linux Community You are currently viewing LQ ns command not found in fedora as

bin sh gcc command not found make error 127

bin sh gcc command not found make error p communities company blog Stack Exchange Inbox Reputation and Badges sign up log in tour help Tour Start here for a quick overview of the site Help Center Detailed answers to any questions you might have Meta Discuss the workings and policies of this site About Us Learn more Make Error Linux about Stack Overflow the company Business Learn more about hiring developers or posting ads g command not found ubuntu with us Ask Ubuntu Questions Tags Users Badges Unanswered Ask Question Ask Ubuntu is a question and answer site for G

error amportal binary cannot be found /usr/local/sbin/amportal

error amportal binary cannot be found usr local sbin amportal p saying amportal binary can not be found has anyone else had an error like this Because the installation was going through a tunnel before and the router died so I tried it again by usr local sbin amportal Line fatal Command Not Found having the installation file locallaly on the machine and then the amportal error comes up freepbx amportal command not found towards the end of the installation But I do a locate and the file is actually there View Replies Similar Messages Bash Amportal Command Not Found

error bash useradd command not found

error bash useradd command not found p User Management Linux General VMware ESXi Red Hat Cluster QUIZ Linux Kernel Linux User Administration Oracle Database Linux General and Permission Contact Bash Useradd Command Not Found Redhat Me VMware Learn about VMware virtualization for its products like vsphere linux useradd command not found ESX and ESXi vCenter Server VMware View VMware P V and many more Linux Step by step bash adduser command not found configuration tutorials for many of the Linux services like DNS DHCP FTP Samba etc including many tips and tricks in Red Hat Linux Database Learn installation and

error command failed /bin/sh jake command not found

error command failed bin sh jake command not found p Sign in Pricing Blog Support Search GitHub option form grunt command not found mac This repository Watch Star Fork geddy geddy grunt command not found ubuntu Code Issues Pull requests Projects Wiki Pulse Graphs New issue grunt command not found windows Cannot generate new project on Mac OS Closed Marak opened this Issue Apr middot comment Projects None Command Not Found Bash Mac yet option form Labels None yet option form Milestone No milestone option form Assignees No one assigned participant Marak commented Apr npm node Trying to perform command

error errors happened while running gettext on

error errors happened while running gettext on p here for a quick overview of the site Help Center Detailed answers to any questions you might msguniq windows have Meta Discuss the workings and policies of this site Install Msguniq About Us Learn more about Stack Overflow the company Business Learn more about hiring developers or posting msguniq command not found ads with us Stack Overflow Questions Jobs Documentation Tags Users Badges Ask Question x Dismiss Join the Stack Overflow Community Stack Overflow is a community of xgettext command not found million programmers just like you helping each other Join them

error executing opt please check aapt

error executing opt please check aapt p here for a quick overview of the site Help Center Detailed answers to any questions you might have Meta Discuss the workings and policies of this site About Us Learn more about Stack Overflow the company Business Learn more about hiring developers or posting ads with aapt command not found mac us Stack Overflow Questions Jobs Documentation Tags Users Badges Ask Question x Dismiss Join the Stack install aapt Overflow Community Stack Overflow is a community of million programmers just like you helping each other Join them it only takes a minute Sign

error occurred during stack walking

error occurred during stack walking p here for a quick overview of the site Help Center Detailed answers to jstack error attaching to process any questions you might have Meta Discuss the workings and policies jstack command not found linux of this site About Us Learn more about Stack Overflow the company Business Learn more jstack get thread regs failed for a lwp about hiring developers or posting ads with us Stack Overflow Questions Jobs Documentation Tags Users Badges Ask Question x Dismiss Join the Stack Overflow Community Stack How To Use Jstack In Linux Overflow is a community of

error output /bin/bash useradd command not found

error output bin bash useradd command not found p user information The adduser command is identical to useradd because it is merely a symbolic link to it useradd's basic syntax is useradd option s username By default useradd can only be used useradd command not found in linux by the root i e omnipotent administrative account On home computers and other computers over Useradd Command Not Found Redhat which the user has complete control the root account can be accessed by logging in as root or preferably by using adduser command not found debian the su i e substitute user

error problems running epstopdf

error problems running epstopdf p here for a quick overview of the site Help Center Detailed answers to any questions you might have Meta Discuss the workings and policies of this site About Us Learn more doxygen epstopdf command not found about Stack Overflow the company Business Learn more about hiring developers or posting ads Sh Epstopdf Command Not Found with us Stack Overflow Questions Jobs Documentation Tags Users Badges Ask Question x Dismiss Join the Stack Overflow Community Stack Overflow miktex is a community of million programmers just like you helping each other Join them it only takes a

error problems running epstopdf. check your tex installation

error problems running epstopdf check your tex installation p instructions Windows Mac Red Hat Linux Ubuntu Click URL instructions Right-click on ad choose Copy Link then paste here rarr This may not be possible with some types of ads More information about our ad policies X doxygen epstopdf command not found You seem to have CSS turned off Please don't fill out this field You sh epstopdf command not found seem to have CSS turned off Please don't fill out this field Briefly describe the problem required Upload screenshot of ad miktex required Select a file or drag drop file

error running xgettext

error running xgettext p here for a quick overview of the site Help Center Detailed answers to any questions you might have Meta msguniq command not found Discuss the workings and policies of this site About Us Learn Msguniq Windows more about Stack Overflow the company Business Learn more about hiring developers or posting ads with us install gettext mac Stack Overflow Questions Jobs Documentation Tags Users Badges Ask Question x Dismiss Join the Stack Overflow Community Stack Overflow is a community of million programmers just like Xgettext Command Not Found you helping each other Join them it only takes

freenas pkg_add error

freenas pkg add error p going into TrueNAS- Release No Target Version freebsd pkg add command not found Target - -U All Target - -U Open Pkg add Command Not Found Pfsense Target - -U RFR Target - -U All Target - -U Open Target Freebsd Install Pkg add - -U All Target - -U Open Target - All Target - Open Unassigned Unscreened staged for FreeNAS- Pkg add Command Not Found Nas free Bug pkg add fails due to read only filesystem Added by Oebele Drijfhout over years ago Updated months ago Status ClosedStart date Priority ImportantDue date Assignee

ftp error 500 command not understood

Ftp Error Command Not Understood p Things Small and Medium Business Service Providers All Solutions Services Advise Transform and Manage Financing and Flexible Capacity IT site chmod command not understood filezilla Support Services Education and Training Services All Services Products site Command Not Understood Godaddy Integrated Systems Composable Systems Converged Systems Hyper Converged Systems Blade Systems Infrastructure Management filezilla file permissions command not understood Software Application Lifecycle Management Application Delivery Management Big Data Analytics DevOps Enterprise Security Hybrid and Private Cloud Information Governance Information Management IT ftp site command not understood Service Management Operations Management Server Management Software as a

gcc command not found error in cygwin

Gcc Command Not Found Error In Cygwin p here for a quick overview of the site Help Center Detailed answers to any questions you might have Meta Discuss the workings and policies of this site About Us Learn more about Stack Overflow the company Business Learn more about hiring developers gcc command not found linux or posting ads with us Stack Overflow Questions Jobs Documentation Tags Users Badges Ask Question x gcc command not found mingw Dismiss Join the Stack Overflow Community Stack Overflow is a community of million programmers just like you helping each other Join them it bash

gem error missing rvm environment file

Gem Error Missing Rvm Environment File p Sign in Pricing Blog Support Search GitHub option form This repository Watch Star Fork rvm rvm Code Issues rvm auto-dotfiles Pull requests Projects Pulse Graphs New issue ERROR Missing Bash Rvm Command Not Found RVM environment file Closed a sk s opened this Issue May middot comments Projects None rvm path yet option form Labels None yet option form Milestone rvm option form Assignees No one assigned participants a sk s commented May This came out of nowhere rvm Add User To Rvm Group get stable followed by rvm gemset reset env didn't

grep command not found error

Grep Command Not Found Error p here for a quick overview of the site Help Center Detailed answers to any questions you might have Meta Discuss the workings and policies of this site About Us Learn more about bash command not found linux Stack Overflow the company Business Learn more about hiring developers or posting ads with us Ls Command Not Found Linux Unix Linux Questions Tags Users Badges Unanswered Ask Question Unix Linux Stack Exchange is a question and answer command not found bash script site for users of Linux FreeBSD and other Un x-like operating systems Join them

hadoop command not found error in ubuntu

Hadoop Command Not Found Error In Ubuntu p here for a quick overview of the site Help Center Detailed answers to any questions you might have Meta Discuss the workings and policies of this no command hdfs found did you mean site About Us Learn more about Stack Overflow the company Business Learn Hadoop Namenode -format Hadoop Command Not Found more about hiring developers or posting ads with us Stack Overflow Questions Jobs Documentation Tags Users Badges Ask Question x Hdfs Command Not Found Mac Dismiss Join the Stack Overflow Community Stack Overflow is a community of million programmers just

java error occurred during stack walking

Java Error Occurred During Stack Walking p Speaker BureauLog inRegisterSearchSearchCancelError You don't have JavaScript enabled This tool uses JavaScript and much of it will not work correctly without it enabled Please turn JavaScript jstack error attaching to process back on and reload this page Please enter a title Jstack Command Not Found Linux You can not post a blank message Please type your message and try again More jstack get thread regs failed for a lwp discussions in JDK's Monitoring Troubleshooting Tools All PlacesJavaJava APIsJDK's Monitoring Troubleshooting Tools This discussion is archived Replies Latest reply on Sep How To Use

jvm error occurred during stack walking

Jvm Error Occurred During Stack Walking p here for a quick overview of the site Help Center Detailed answers to any questions you jstack error attaching to process might have Meta Discuss the workings and policies of this site Jstack Command Not Found Linux About Us Learn more about Stack Overflow the company Business Learn more about hiring developers or Jstack Get thread regs Failed For A Lwp posting ads with us Stack Overflow Questions Jobs Documentation Tags Users Badges Ask Question x Dismiss Join the Stack Overflow Community Stack Overflow is a community of How To Use Jstack In

libtool error

Libtool Error p here for a quick overview of the site Help Center Detailed answers to any questions you might have Meta Discuss the workings and policies Libtool Version Mismatch Error This Is Libtool But The of this site About Us Learn more about Stack Overflow the company libtool version-info Business Learn more about hiring developers or posting ads with us Stack Overflow Questions Jobs Documentation Tags Users Definition Of This Lt init Comes From An Older Release Badges Ask Question x Dismiss Join the Stack Overflow Community Stack Overflow is a community of million programmers just like you helping

libcap compile error

Libcap Compile Error p osx Pages You must login or register to post a reply RSS topic feed Posts Topic by mmrasheed - - mmrasheed Member Offline Registered - - Posts make yacc command not found Topic libcap compile error in mac osx Hi While compiling the openwrt your operating system s lex is insufficient to compile libsfbpf in mac os x I get error in compiling libcap Volumes openwrt build dir target-mipsel kec dsp uClibc- libcap- libcap include sys capability h fatal error 'linux types h' file not found include linux types h Makefile Recipe For Target grammar c

make clean error 127 ignored

Make Clean Error Ignored p here for a quick overview of the site Help Center Detailed answers to any questions you might have Meta Discuss recipe for target clean failed eclipse the workings and policies of this site About Us Learn more about Make Del Command Not Found Stack Overflow the company Business Learn more about hiring developers or posting ads with us Stack Overflow mingw -make clean Questions Jobs Documentation Tags Users Badges Ask Question x Dismiss Join the Stack Overflow Community Stack Overflow is a community of million programmers just like you helping each make del command not

ns command not found error

Ns Command Not Found Error p subject author Hi Yu Yang ns command not found cygwin You didn't properly set your PATH variable To assert ns bash ns command not found cygwin is present in the folder type this ls -l root ns-allinone- ns- ns To run ns without a ns command not found in fedora special PATH variable give the absolute path to ns root ns-allinone- ns- ns simulation tcl Have building installing ns it gives instructions to properly set the environnement variables You Bash Command Not Found Cygwin need to follow these instructions Good luck ppl P S

nvm error

Nvm Error p Sign in Pricing Blog Support Search GitHub option form This repository Watch Star Fork creationix nvm Code Issues Pull requests Projects Wiki Pulse Graphs New issue Error Cannot find module ' nvm-help' cannot find module nvm-help windows Closed i ting opened this Issue May middot comments Projects None yet nvm readme option form Labels None yet option form Milestone No milestone option form Assignees No one assigned participants i ting commented May module js throw -bash usr local bin nvm no such file or directory err Error Cannot find module ' nvm-help' at Function Module resolveFilename module

ping unrecognized command error

Ping Unrecognized Command Error p here for a quick overview of the site Help Center Detailed answers to any questions you might have Meta Discuss the ping is not recognized windows workings and policies of this site About Us Learn more about Stack Ping Command Not Working Windows Overflow the company Business Learn more about hiring developers or posting ads with us Stack Overflow Questions Jobs Ping Is Not A Recognized Command Windows Documentation Tags Users Badges Ask Question x Dismiss Join the Stack Overflow Community Stack Overflow is a community of million programmers just like you helping each other

pkg_add error

Pkg add Error p p p here for a quick overview of the site Help Center Detailed answers to any questions you might have Meta Discuss the workings and policies of this site pkg command not found freebsd About Us Learn more about Stack Overflow the company Business Learn more about pkg add freebsd hiring developers or posting ads with us Super User Questions Tags Users Badges Unanswered Ask Question Super User is Pkg add Openbsd a question and answer site for computer enthusiasts and power users Join them it only takes a minute Sign up Here's how it works

pkg_add error freebsd

Pkg add Error Freebsd p get ftp ftp freebsd org pub FreeBSD ports i packages- -release Latest Error Unable to get ftp ftp freebsd org pub FreeBSD ports i packages- -release Latest July by Sharad Chhetri Comment Error Unable to get ftp ftp freebsd org pub FreeBSD ports i packages- -release Latest vim tbz This was my Freebsd Pkg add Command Not Found first encounter with problem while working in freebsd after doing freebsd install pkg add fresh install I was trying to install vim in freebsd by using the command pkg add -r vim Pkg add Command Not Found

plink error command not found on remote host

Plink Error Command Not Found On Remote Host p here for a quick overview of the site Help Center Detailed answers to any questions you might have Meta Discuss the workings plink bash command not found and policies of this site About Us Learn more about Stack Overflow Plink Multiple Commands the company Business Learn more about hiring developers or posting ads with us Unix Linux Questions Tags plink download Users Badges Unanswered Ask Question Unix Linux Stack Exchange is a question and answer site for users of Linux FreeBSD and other Un x-like operating systems Join them it only

pod to mac error

Pod To Mac Error p Sign in Pricing Blog Support Search GitHub option form This repository Watch Star Fork CocoaPods CocoaPods Code Issues Pull requests Projects Wiki Pulse Graphs New issue pod command not found pod command not found mac after installing on OS X El Capitan Beta Closed danielbyon opened this pod command not found el capitan Issue Jun middot comments Projects None yet option form Labels None yet option form Milestone No milestone option form Assignees No Pod Install Command Not Found El Capitan one assigned participants and others danielbyon commented Jun Trying to setup an OS X

postfix ehlo 502 5.5.2 error command not recognized

Postfix Ehlo Error Command Not Recognized p for Help Receive Real-Time Help Create a Freelance Project Hire for a Full Time Job Ways to Get Help Ask a Question Ask for Help Receive Real-Time Help Smtp Error Command Not Recognized Create a Freelance Project Hire for a Full Time Job Ways to telnet error command not recognized Get Help Expand Search Submit Close Search Login Join Today Products BackProducts Gigs Live Careers Vendor Services Groups Ehlo Command Not Recognized Website Testing Store Headlines Experts Exchange Questions SMTP Helo commands not recognised Want to Advertise Here Solved SMTP Helo commands not

postfix ehlo error command not recognized

Postfix Ehlo Error Command Not Recognized p for Help Receive Real-Time Help Create a Freelance Project Hire for a Full Time Job Ways to Get Help Ask a Question Ask for Help Receive Real-Time Help Create a Freelance Project Hire for smtp error command not recognized a Full Time Job Ways to Get Help Expand Search Submit Close postfix ehlo error command not recognized Search Login Join Today Products BackProducts Gigs Live Careers Vendor Services Groups Website Testing Store Headlines Experts Exchange telnet error command not recognized Questions SMTP Helo commands not recognised Want to Advertise Here Solved SMTP Helo

pod to mac update error

Pod To Mac Update Error p Sign in Pricing Blog Support Search GitHub option form This repository Watch Star Fork CocoaPods CocoaPods Code Issues Pull requests Projects Wiki Pulse Graphs New issue pod command not found mac pod command not found after installing on OS X El Capitan Beta error while executing gem errno eperm operation not permitted - usr bin xcodeproj Closed danielbyon opened this Issue Jun middot comments Projects None yet option form Labels None yet Pod Init Command Not Found option form Milestone No milestone option form Assignees No one assigned participants and others danielbyon commented Jun

protoc failed error /bin/sh protoc command not found

Protoc Failed Error bin sh Protoc Command Not Found p here for a quick overview of the site Help Center make protoc command not found caffe Detailed answers to any questions you might have Meta Discuss Make Protoc Command Not Found Ubuntu the workings and policies of this site About Us Learn more about Stack Overflow the fatal error google protobuf stubs common h no such file or directory company Business Learn more about hiring developers or posting ads with us Stack Overflow Questions Jobs Documentation Tags Users Badges Ask Question x Dismiss install protoc mac Join the Stack Overflow

python command not found error

Python Command Not Found Error p here for a quick overview of the site Help Center Detailed answers to any questions you might have Meta Discuss the workings python command not found bash and policies of this site About Us Learn more about Stack Overflow python command not found ubuntu the company Business Learn more about hiring developers or posting ads with us Stack Overflow Questions Jobs Documentation python command not found git bash Tags Users Badges Ask Question x Dismiss Join the Stack Overflow Community Stack Overflow is a community of million programmers just like you helping each other

qt build error 127

Qt Build Error p download a browser that supports JavaScript or enable it if it's disabled i e NoScript Home Qt Development Installation and Deployment Error while debugging an example code Make Error Linux Error while debugging an example code This topic has been deleted Only makefile error command not found users with topic management privileges can see it debamalya last edited by Hi I am new to Qt bash make command not found cygwin I installed the qt sdk yesterday When i tried compiling and executing an example code I am getting an error Could someone please help me

qt make error 127

Qt Make Error p QtForum org raquo Qt raquo Qt Designer raquo after qmake make gives error Dear visitor welcome to QtForum org If this is your first visit here make error linux please read the Help It explains in detail how this page works Makefile Error Command Not Found To use all features of this page you should consider registering Please use the registration form to bash make command not found cygwin register here or read more information about the registration process If you are already registered please login here Skip user information logicTRANCE Beginner Posts Location Pune India

rcpt to 502 5.5.2 error command not recognized

Rcpt To Error Command Not Recognized p few minutes Join Now Prev Next Replies error command not recognized postfix Mace OP Alex Sep at UTC telnet error command not recognized Fabien wrote Would I find the log in var mail That folder is empty other than for Postfix Ehlo Error Command Not Recognized a -byte file called rpc No in var log Mace OP Alex Sep at UTC Port thinking was along the Ehlo Command Not Recognized lines of TLS liken Ben started to go down you may not have this enabled Serrano OP Hammer bb Sep at UTC If