Home > does not > codeblocks error string does not name a type

Codeblocks Error String Does Not Name A Type

Contents

here for a quick overview of the site Help Center Detailed answers to any questions you might have Meta Discuss the workings and policies of this site About Us Learn more about Stack Overflow the company Business Learn

String In Namespace Std Does Not Name A Type

more about hiring developers or posting ads with us Stack Overflow Questions Jobs Documentation Tags string does not name a type c++ Users Badges Ask Question x Dismiss Join the Stack Overflow Community Stack Overflow is a community of 4.7 million programmers, just like you,

Error Does Not Name A Type C++

helping each other. Join them; it only takes a minute: Sign up C++ errors: ‘string’ does not name a type up vote 2 down vote favorite 1 when I compile the following files, I've got the error: ECArgs.h:36:3: string does not name a type arduino error: ‘string’ does not name a type ECArgs.h:36: ECString value(char c); Could somebody give me any hints for the error? ECArgs.h #include #include "ECString.h" class ECArgs { public: ECArgs(int argc, char *argv[]); int nargs() { return nargs_; } bool isset(char c); ECString value(char c); ECString arg(int n) { return argList[n]; } private: int nargs_; int nopts_; ECString argList[32]; list optList; }; ECString.h #define ECS gnu #if ECS == gnu #include #define ECString string using exception in namespace std does not name a type namespace std; #else #include #define ECString string #endif c++ string compiler-errors share|improve this question edited Mar 4 '13 at 4:34 asked Mar 4 '13 at 4:06 Xing Shi 1,0341725 It's not a "wired" error. It's perfectly reasonable not to recognize a symbol from a non-included header. Also, typedef and using are better solutions for type aliases than #define. –chris Mar 4 '13 at 4:08 @chris What do you mean by non-included header? –Xing Shi Mar 4 '13 at 4:11 If you want to get access to std::string, you need to #include , not #include . –jogojapan Mar 4 '13 at 4:13 Precisely what the answer says. std::string is in and you never include it. Therefore, the compiler is perfectly reasonable in complaining. –chris Mar 4 '13 at 4:13 @chris You are right, thanks. –Xing Shi Mar 4 '13 at 4:34 | show 1 more comment 2 Answers 2 active oldest votes up vote 1 down vote accepted You need to add: #include cstring includes function to manipulate C-style string. This version works: #include #include #if ECS == gnu #include #define ECString string using namespace std; #else #include #define ECString string #endif class ECArgs { public: ECArgs(int argc, char *argv[]); int nargs() { return nargs_; } bool isset(char c); ECString valu

my .cpp, but i keep getting the error 'string' does not name a type when i try to compile! why?!? any ideas? i thought #include

_dev_t Does Not Name A Type

was what INCLUDED the library for using strings?? this is in a header error '_dev_t' does not name a type file attached to a .cpp that i'm using to store classes and class member functions to be used by the client

Error Vector Does Not Name A Type

program, does that make a difference? i'll throw up the part of my code where it says i have this problem..: 1
2
3
4
5
6
7
8
9
10
11
12
13
14
15
16
17
18
19
20
21
22
23
24
#include #include #include #include #include #include http://stackoverflow.com/questions/15194395/c-errors-string-does-not-name-a-type #include #include //using namespace std; //******************************************************************** //CLASSES //******************************************************************** //******************************************************************** //Class InvBin //******************************************************************** class InvBin { private: string description; // item name int qty; // Quantity of items // in this bin and the error says: 'string' does not name a type please excuse the LIST of includes... my prof told me that if you don't use it the compiler ignores it so it's not a bad http://www.cplusplus.com/forum/general/64054/ idea to just make a master list, so you don't have to keep remembering to type in the ones you need... Last edited on Mar 8, 2012 at 9:47pm UTC Mar 8, 2012 at 9:47pm UTC LB (13378) Change "string" to "std::string" Most likely you did not mean to comment out line 12. Also, what your professor told you only applies when you have optimizations on - in debug mode (no optimizations) it does not apply. Last edited on Mar 8, 2012 at 9:49pm UTC Mar 8, 2012 at 9:53pm UTC C Theroux (23) oh! you're right on line 12.. and if i uncomment it, i shouldn't have any problems there right? also, i noticed in other student's examples that they didn't need to use the "namespace std;" line in a header file, only in the main.cpp... but i didn't notice SPECIFICALLY if they were using the std:: class scope every time... does having the namespace line in everything complicate things at all? or is it more about efficiency in coding when it comes to wether or not you inlcude it? Mar 8, 2012 at 9:56pm UTC LB (13378) Namespaces were meant to prevent cases where you give something the same name as somethi

Forum Visual C++ & C++ Programming C++ (Non Visual C++ Issues) 29: error: string does not name a type If this is your http://forums.codeguru.com/showthread.php?432468-29-error-%91string%92-does-not-name-a-type first visit, be sure to check out the FAQ by clicking the link https://openclassrooms.com/forum/sujet/string-does-not-name-a-type-91629 above. You may have to register or Login before you can post: click the register link above to proceed. To start viewing messages, select the forum that you want to visit from the selection below. Results 1 to 9 of 9 Thread: 29: error: string does not name a type Tweet does not Thread Tools Show Printable Version Email this Page… Subscribe to this Thread… Display Linear Mode Switch to Hybrid Mode Switch to Threaded Mode August 26th, 2007,02:28 AM #1 joebar View Profile View Forum Posts Member Join Date Aug 2006 Posts 144 [solved]29: error: string does not name a type Hi, when try to compile my program I get the following message for this does not name header file Code: #ifndef SENDSMS_H #define SENDSMS_H #include "ui_sendSMS.h" #include class sendSMS : public QMainWindow, public Ui::MainWindow{ Q_OBJECT public: sendSMS (QMainWindow *parent = 0); ~sendSMS(); private slots: void slotClose(); void calcChar(); void slotSend(); QString clean_string(QString); QChar get_param(QString, int); QString get_param_value(QString, int); void process_line(QString); void read_config_file(); private: int maxChar; QString param_filename; string username; string password; string sourceno; }; #endif Ignore all the "Q" things, thats something Qt specific. int works fine, but not string. I have the string header included. I guess it is rather simple what is wrong.... Thanks, J. Last edited by joebar; August 26th, 2007 at 04:12 AM. Reply With Quote August 26th, 2007,02:30 AM #2 laserlight View Profile View Forum Posts Elite Member Power Poster Join Date Jan 2006 Location Singapore Posts 6,699 Re: 29: error: string does not name a type Use std::string instead of the unqualified string. C + C++ Compiler: MinGW port of GCC Build + Version Control System: SCons + Bazaar Look up a C/C++ Reference and learn How To Ask Questions The Smart Way Kindly rate my posts if you found them useful Reply With Quote August 26th, 2007,06:03 P

Parcours Cours Partenaires Forums Premium S'inscrire Se connecter Inscription S'inscrire avec Facebook S'inscrire avec Google Wonder Prénom* Nom* Adresse email* Vous recevrez votre mot de passe sur cette adresse email. J'ai lu et j'accepte les Conditions Générales d'Utilisation.* S'inscrire Connexion Se connecter avec Facebook Se connecter avec Google Adresse email ou nom d'utilisateur* Mot de passe* Se souvenir de moi Mot de passe oublié Se connecter Pas encore membre ? Inscrivez-vous gratuitement en 30s. S'inscrire Se connecter Forums des Zéros Une question ? Pas de panique, on va vous aider ! Fil d'Ariane Accueil Forum Programmation Langage C++ String does not name a type Liste des forums Partage String does not name a type polsk 3 février 2012 à 12:18:01 Bonjour, Me voici avec mon deuxième programme et une erreur que je ne comprend pas, peut être un problème de bibliotheque. Je déclare dans un fichier .h une classe comportant plusieurs string seulement lors de la compilation le terminal affiche "string does not name a type". Puis par la suite : 'struct Voiture' has no member name 'modele'. Sachant que ces deux erreurs se répètent pour chaque string déclaré.Voici le .h en question : #ifndef VOITURE_H_INCLUDED #define VOITURE_H_INCLUDED struct Voiture { string modele; string immatriculation; int kilometrage; string disponible; }; Voiture *lireDonnees (int &n); int menu(); void afficheDisponible (Voiture *V, int n); void loue(Voiture &v); void louer(Voiture *V, int n); void retour(Voiture &v); void retourner(Voiture *V, int n); #endif De plus il y a tout à la fin de la serie d'erreur affichées par le terminal une erreur que je n'ai encore jamais vus : make : *** [main.o] Erreur 1 J'ajoute de plus les déclaration de mes fonctions dans le .cpp si jamais celà peut vous servir : cout << " 0: Fin du prrogramme"<< endl; cout << " Votre choix :"<< endl; int n; do{cin>>n;} while (n<0 || n<3); return n; } void afficheDisponible (Voiture *V, int n) { cout <<" Les voitures disponibles sont : "<> immatriculation2; for (int i=

 

Related content

a2ensite error does not exist

A ensite Error Does Not Exist table id toc tbody tr td div id toctitle Contents div ul li a href A ensite Command Not Found Centos a li li a href Site Does Not Exist Web Deploy a li li a href Sudo A ensite Disable a li ul td tr tbody table p here for a quick overview of the site Help Center Detailed answers to any questions relatedl you might have Meta Discuss the workings and policies a ensite command not found of this site About Us Learn more about Stack Overflow the company Business p h

activate windows 7 error dns does not exist

Activate Windows Error Dns Does Not Exist table id toc tbody tr td div id toctitle Contents div ul li a href Activate Windows Dns Name Does Not Exist Server a li li a href Activation Error x b a li li a href Error Code x b Windows a li ul td tr tbody table p One relatedl games Xbox games PC activate windows dns name does not exist games Windows games Windows phone games Entertainment All p h id Activate Windows Dns Name Does Not Exist Server p Entertainment Movies TV Music Business Education Business Students p h

activity manager error activity class does not exist android

Activity Manager Error Activity Class Does Not Exist Android table id toc tbody tr td div id toctitle Contents div ul li a href Error Activity Class Does Not Exist Android Studio a li li a href Activity Class Does Not Exist React Native a li li a href Delete Build Directory Android Studio a li li a href When An Activity Does Not Exist In Memory It Is In Which State a li ul td tr tbody table p here for a quick overview of the site Help Center Detailed answers to any questions you might have Meta Discuss

android activitymanager error activity class does not exist

Android Activitymanager Error Activity Class Does Not Exist table id toc tbody tr td div id toctitle Contents div ul li a href When An Activity Does Not Exist In Memory It Is In Which State a li li a href Activity Class Does Not Exist Adb a li li a href Error Type Error Activity Class Does Not Exist Error While Launching Activity a li ul td tr tbody table p here for a quick overview of the site Help Center relatedl Detailed answers to any questions you might have error activity class does not exist android studio Meta

android error generating final archive file not found

Android Error Generating Final Archive File Not Found table id toc tbody tr td div id toctitle Contents div ul li a href specified For Property Resourcefile Does Not Exist a li li a href Packaged Resources Does Not Exist Xamarin a li li a href The File Obj Debug Android Bin Packaged Resources Does Not Exist a li ul td tr tbody table p here for a quick overview of the site Help Center Detailed answers to any questions you might have Meta Discuss the workings and policies of relatedl this site About Us Learn more about Stack Overflow

ant error buildfile does not exist

Ant Error Buildfile Does Not Exist table id toc tbody tr td div id toctitle Contents div ul li a href Build xml Does Not Exist In The Project a li li a href Build xml Does Not Exist Ant Salesforce a li li a href Install Ant Mac a li li a href Download Ant a li ul td tr tbody table p here for a quick overview of the site Help Center Detailed answers to any questions you might have Meta relatedl Discuss the workings and policies of this site About Us buildfile build xml does not exist

ant compile error package does not exist

Ant Compile Error Package Does Not Exist table id toc tbody tr td div id toctitle Contents div ul li a href Error Package Does Not Exist Maven a li li a href Ant Cannot Find Symbol a li li a href Ant Build xml Tutorial a li ul td tr tbody table p here for a quick overview of the relatedl site Help Center Detailed answers to any questions lib does not exist ant you might have Meta Discuss the workings and policies of this package does not exist in java site About Us Learn more about Stack Overflow

ant error buildfile build.xml does not exist

Ant Error Buildfile Build xml Does Not Exist table id toc tbody tr td div id toctitle Contents div ul li a href Ant Buildfile Build xml Does Not Exist Build Failed a li li a href Apache Ant Buildfile Build xml Does Not Exist a li li a href Apache Ant Build xml Does Not Exist a li ul td tr tbody table p here for a quick overview relatedl of the site Help Center Detailed answers to buildfile build xml does not exist ant windows any questions you might have Meta Discuss the workings and p h id

ant error package javax.servlet.http does not exist

Ant Error Package Javax servlet http Does Not Exist table id toc tbody tr td div id toctitle Contents div ul li a href Package Javax servlet jsp Does Not Exist a li li a href Package Javax servlet jsp Does Not Exist Maven a li li a href Package Javax servlet Does Not Exist Intellij a li ul td tr tbody table p here for a quick overview of the site Help Center Detailed answers to any questions you might have Meta Discuss the workings and policies relatedl of this site About Us Learn more about Stack Overflow java

ant error target build.xml does not exist in the project

Ant Error Target Build xml Does Not Exist In The Project table id toc tbody tr td div id toctitle Contents div ul li a href Default Target Build Does Not Exist In This Project a li li a href Build xml Does Not Exist Ant a li li a href Target Compile Does Not Exist In The Project a li ul td tr tbody table p here for a quick relatedl overview of the site Help Center Detailed target does not exist in the project ant answers to any questions you might have Meta Discuss the p h id

ant error target build does not exist in the project

Ant Error Target Build Does Not Exist In The Project table id toc tbody tr td div id toctitle Contents div ul li a href Default Target Build Does Not Exist In This Project a li li a href Build xml Does Not Exist Ant a li li a href The Target Build Does Not Exist In The Project Visual Studio a li li a href Target Does Not Exist In The Project Null a li ul td tr tbody table p here for a quick overview of the site Help Center Detailed answers to any questions you might have

ant package does not exist error

Ant Package Does Not Exist Error table id toc tbody tr td div id toctitle Contents div ul li a href Error Package Does Not Exist Maven a li li a href Javac Error Package Does Not Exist a li li a href Package Does Not Exist In Java a li ul td tr tbody table p here for a quick overview of the site Help Center relatedl Detailed answers to any questions you might have package does not exist error in java Meta Discuss the workings and policies of this site About Us error package does not exist android

ant error target does not exist in the project

Ant Error Target Does Not Exist In The Project table id toc tbody tr td div id toctitle Contents div ul li a href Target test Does Not Exist In The Project a li li a href Target Does Not Exist In The Project Msbuild a li li a href Target Does Not Exist In The Project Null a li ul td tr tbody table p here for a quick overview of the site Help Center Detailed answers to any questions you might have Meta Discuss relatedl the workings and policies of this site About Us default target build does

ant error package javax.servlet does not exist

Ant Error Package Javax servlet Does Not Exist table id toc tbody tr td div id toctitle Contents div ul li a href Package Javax servlet http Does Not Exist Maven a li li a href Package Javax servlet jsp Does Not Exist a li li a href Javax Package Does Not Exist Netbeans a li li a href Package Javax servlet jsp Does Not Exist Maven a li ul td tr tbody table p here for a quick overview of the site Help Center Detailed answers to any questions relatedl you might have Meta Discuss the workings and policies

aol relay error

Aol Relay Error table id toc tbody tr td div id toctitle Contents div ul li a href The Recipient Was Rejected By The Server Iphone a li li a href Cannot Send Mail Server Does Not Allow Relaying a li li a href Server Does Not Allow Relaying Fix a li ul td tr tbody table p not post a blank message Please type your message and try again krystalmaree Level points Q server does not allow relaying email error Since upgrading to iPhone sending an email always results in the error message relatedl A copy has been placed

apple iphone relaying error

Apple Iphone Relaying Error table id toc tbody tr td div id toctitle Contents div ul li a href The Recipient Was Rejected By The Server Because It Does Not Allow Relaying Iphone a li li a href Cannot Send Mail Server Does Not Allow Relaying a li li a href Relaying Meaning a li ul td tr tbody table p it does not allow relaying when I try to send it If you try to send an email from your iPhone relatedl on iOS or an earlier iOS for that matter and server does not allow relaying ipad get

asp net does not contain a definition for error

Asp Net Does Not Contain A Definition For Error table id toc tbody tr td div id toctitle Contents div ul li a href Does Not Contain A Definition For Are You Missing A Using Directive Or An Assembly Reference a li li a href Does Not Contain A Definition For And No Extension Method Entity Framework a li li a href Object Does Not Contain A Definition For And No Extension Method a li ul td tr tbody table p here for a quick overview of the site Help Center Detailed answers to any questions you might have Meta

asp.net compilation error cs1061

Asp net Compilation Error Cs table id toc tbody tr td div id toctitle Contents div ul li a href Cs asp default aspx Does Not Contain A Definition For a li li a href Does Not Contain A Definition For Are You Missing A Using Directive Or An Assembly Reference a li li a href Asp default aspx Does Not Contain A Definition For button click a li ul td tr tbody table p here for a quick overview of the site Help Center Detailed answers relatedl to any questions you might have Meta Discuss error cs c the

attempted to open sandboxed jar error

Attempted To Open Sandboxed Jar Error table id toc tbody tr td div id toctitle Contents div ul li a href Java Lang Securityexception Does Not Match Trust Level Of Other Classes In The Same Package a li li a href Java Mixed Code Disable Verification a li ul td tr tbody table p here for a quick overview of the site Help Center Detailed answers to relatedl any questions you might have Meta Discuss the security exception attempted to open sandboxed jar workings and policies of this site About Us Learn more about Stack does not match trust level

aws error message the specified key does not exist

Aws Error Message The Specified Key Does Not Exist table id toc tbody tr td div id toctitle Contents div ul li a href S Nosuchkey a li li a href Amazon S No Such Key a li li a href Codedeploy The Specified Key Does Not Exist a li ul td tr tbody table p to retrieve a file from Amazon's S storage Error Code NoSuchKey Code Message The specified key does not exist Message Key path to some file Key RequestId hdhjdkksd ahks RequestId relatedl HostI d zxC jbF sdfoiklasd f asdfiasldo oy KF F f dj JuTx

bios update error 9996

Bios Update Error table id toc tbody tr td div id toctitle Contents div ul li a href Your System Does Not Meet The Minimum Requirements For Optimal Settings In This Game a li li a href This Computer Does Not Meet The Minimum Requirements For Installing The Software How To Fix a li li a href Hp Support Drivers a li li a href net Download a li ul td tr tbody table p Links Site Index Your system does not meet the minimum requirements When installing an update from Hewlett Packard you may receive the following error message

04043 error

Error table id toc tbody tr td div id toctitle Contents div ul li a href Ora- Object Sys plsql Does Not Exist a li li a href Ora- Drop User a li li a href Drop Package Ora- Object Does Not Exist a li li a href Ora Object Instances util Does Not Exist a li ul td tr tbody table p CommunityOracle User Group CommunityTopliners CommunityOTN Speaker BureauJava CommunityError You don't have JavaScript enabled This tool uses JavaScript and much of it will not work correctly without it enabled Please turn JavaScript back on and reload this relatedl

caused by org.postgresql.util.psqlexception error schema does not exist

Caused By Org postgresql util psqlexception Error Schema Does Not Exist table id toc tbody tr td div id toctitle Contents div ul li a href Org postgresql util psqlexception Error Column Does Not Exist a li li a href Org postgresql util psqlexception Error Relation Does Not Exist Position a li li a href Org postgresql util psqlexception Error Relation Sequence Does Not Exist a li ul td tr tbody table p here for a quick overview of the site Help Center Detailed answers relatedl to any questions you might have Meta Discuss error relation does not exist in

category does not exist error

Category Does Not Exist Error table id toc tbody tr td div id toctitle Contents div ul li a href Package Does Not Exist Error a li li a href It Does Exist Gif a li li a href It Does Exist Meme a li ul td tr tbody table p viewing IIS Worker Processes in IIS Manager x x x x x x x x x x x x x x x robmcmOctober I ran into an interesting problem recently when relatedl using the new Worker Processes feature in the Internet Information p h id Package Does Not Exist

caused by org.postgresql.util.psqlexception error column does not exist

Caused By Org postgresql util psqlexception Error Column Does Not Exist p here for a quick overview relatedl of the site Help Center Detailed answers to hibernate org postgresql util psqlexception error column does not exist any questions you might have Meta Discuss the workings and org postgresql util psqlexception error schema does not exist policies of this site About Us Learn more about Stack Overflow the company Business Learn org postgresql util psqlexception error column of relation does not exist more about hiring developers or posting ads with us Stack Overflow Questions Jobs Documentation Tags Users Badges Ask Question

compiler error message cs0117 does not contain a definition for

Compiler Error Message Cs Does Not Contain A Definition For table id toc tbody tr td div id toctitle Contents div ul li a href Error Cs Does Not Contain A Definition a li li a href Error Cs Unity a li li a href Error Cs resource Does Not Contain A Definition For animation a li ul td tr tbody table p resources Windows Server resources Programs MSDN subscriptions Overview Benefits Administrators Students Microsoft relatedl Imagine Microsoft Student Partners ISV Startups TechRewards Events cs xamarin Community Magazine Forums Blogs Channel Documentation APIs and reference p h id Error Cs

code blocks error does not name a type

Code Blocks Error Does Not Name A Type table id toc tbody tr td div id toctitle Contents div ul li a href Does Not Name A Type C Struct a li li a href Variable Does Not Name A Type C a li li a href Does Not Name A Type Arduino a li ul td tr tbody table p here for a quick overview of the site Help Center Detailed answers to any questions you might have Meta Discuss the workings and policies relatedl of this site About Us Learn more about Stack Overflow class does not name

could not parse metalink error was no repomd file

Could Not Parse Metalink Error Was No Repomd File table id toc tbody tr td div id toctitle Contents div ul li a href Error File var cache yum i epel metalink xml Does Not Exist a li li a href File var cache yum x epel metalink xml Does Not Exist a li li a href Cannot Retrieve Metalink For Repository Epel X Centos a li li a href No Package Epel Release Available a li ul td tr tbody table p Common F Bugs Common F Bugs Communicate with Fedora The Documents Bug Reports Fedora Update System Bodhi

compiler error does not name a type

Compiler Error Does Not Name A Type table id toc tbody tr td div id toctitle Contents div ul li a href C Does Not Name A Type Class a li li a href Variable Does Not Name A Type C a li li a href C Does Not Name A Type Typedef a li li a href Has Incomplete Type C a li ul td tr tbody table p here for a quick overview of the site Help Center Detailed answers to relatedl any questions you might have Meta Discuss the workings does not name a type c error

compiler error message cs1061 does not contain a definition for

Compiler Error Message Cs Does Not Contain A Definition For table id toc tbody tr td div id toctitle Contents div ul li a href Error Cs C a li li a href Cs Error a li li a href Does Not Contain A Definition For Are You Missing A Using Directive Or An Assembly Reference a li ul td tr tbody table p here for a quick overview of the site Help Center Detailed answers to any questions relatedl you might have Meta Discuss the workings and policies error cs does not contain a definition for of this site

compiler error message cs1061 asp net

Compiler Error Message Cs Asp Net table id toc tbody tr td div id toctitle Contents div ul li a href Error Cs Does Not Contain A Definition For a li li a href Cs Error a li li a href Error Cs Unity a li li a href Does Not Contain A Definition For C a li ul td tr tbody table p here for a quick overview of the site Help Center Detailed answers to any questions you might have Meta Discuss the workings and policies of this relatedl site About Us Learn more about Stack Overflow the

compile error does not name a type

Compile Error Does Not Name A Type table id toc tbody tr td div id toctitle Contents div ul li a href Error Does Not Name A Type C a li li a href Error Does Not Name A Type Typedef a li ul td tr tbody table p here for a quick overview of the site Help Center Detailed answers to any questions you might have Meta Discuss the workings and policies of this site About Us Learn more about relatedl Stack Overflow the company Business Learn more about hiring developers or posting compile error type mismatch ads with

comcast error yprpb

Comcast Error Yprpb table id toc tbody tr td div id toctitle Contents div ul li a href Your Hdtv Does Not Support Hdcp Charter a li li a href The Dvi hdmi Output Is Blocked a li ul td tr tbody table p input input input input input input CommunityCategoryBoardUsers input input turn on suggestions Auto-suggest helps you quickly narrow down your search results by suggesting possible matches as you type Showing results for Search instead relatedl for Did you mean members online now discussions yprpb cable Xfinity Help and Support Forums TV Service and Equipment HDTV HDCP issue

control does not exist in current context error

Control Does Not Exist In Current Context Error table id toc tbody tr td div id toctitle Contents div ul li a href Does Not Exist In The Current Context C a li li a href The Name Does Not Exist In The Current Context C a li li a href The Name viewbag Does Not Exist In The Current Context a li li a href The Name model Does Not Exist In The Current Context a li ul td tr tbody table p here for a quick overview of the site Help Center Detailed answers to any questions you

build.xml error package does not exist

Build xml Error Package Does Not Exist table id toc tbody tr td div id toctitle Contents div ul li a href Lib Does Not Exist Ant a li li a href Package Does Not Exist In Java a li li a href Ant Build xml Tutorial a li li a href Javac Package Does Not Exist a li ul td tr tbody table p here for a quick overview of the site Help Center Detailed relatedl answers to any questions you might have Meta Discuss p h id Lib Does Not Exist Ant p the workings and policies of

build error duplicate project id found in

Build Error Duplicate Project Id Found In table id toc tbody tr td div id toctitle Contents div ul li a href Package Org hibernate Does Not Exist a li li a href Package Org hibernate annotations Does Not Exist a li ul td tr tbody table p when I run artifact dependenciesfrom relatedl a project that has a parent package javax persistence does not exist netbeans pom It use to work in artifact dependencies An error package javax persistence does not exist maven has occurred while processing theMaven artifact tasks artifact dependencies Diagnosis artifact dependencies artifact dependencies Unable to

byte does not name a type arduino error

Byte Does Not Name A Type Arduino Error table id toc tbody tr td div id toctitle Contents div ul li a href Byte Was Not Declared In This Scope C a li li a href Arduino Byte Has Not Been Declared a li li a href Unknown Type Name Byte a li li a href C byte a li ul td tr tbody table p read only Software Troubleshooting error 'byte' does not name a type Print Go Down Pages Topic error 'byte' does relatedl not name a type Read times previous topic - next p h id Byte

configurationmanager does not exist current context error

Configurationmanager Does Not Exist Current Context Error table id toc tbody tr td div id toctitle Contents div ul li a href The Name Configurationmanager Does Not Exist In The Current Context a li li a href Configurationmanager C a li li a href Configurationmanager Not Found a li li a href Configuration Manager In C Windows Application a li ul td tr tbody table p here for a quick overview of the site Help Center Detailed answers to any questions you might have Meta relatedl Discuss the workings and policies of this site About Us p h id The

c# datagridview currencymanager error

C Datagridview Currencymanager Error table id toc tbody tr td div id toctitle Contents div ul li a href Datagridview System indexoutofrangeexception Index Does Not Have A Value a li ul td tr tbody table p here for a quick overview of the system windows forms datagridview datagridviewdataconnection geterror int rowindex site Help Center Detailed answers to any questions datagridviewrow index - c you might have Meta Discuss the workings and policies of this site About Us datagridview index does not have a value Learn more about Stack Overflow the company Business Learn more about hiring developers or posting ads

configuration error description the specified user does not exist

Configuration Error Description The Specified User Does Not Exist table id toc tbody tr td div id toctitle Contents div ul li a href Dbnetlib Connectionopen connect Sql Server Does Not Exist Or Access Denied a li li a href Sql Server Does Not Exist Or Access Denied Sql Server R a li li a href How To Fix Sql Server Does Not Exist Or Access Denied a li li a href Sql Server Does Not Exist Or Access Denied Sql Server a li ul td tr tbody table p relatedl HomeLibraryLearnDownloadsTroubleshootingCommunityForums Ask a question Quick access p h id

configurationmanager does not exist in the current context error

Configurationmanager Does Not Exist In The Current Context Error table id toc tbody tr td div id toctitle Contents div ul li a href Error The Name configurationmanager Does Not Exist In The Current Context a li li a href The Name Configurationmanager Does Not Exist In The Current Context Class Library a li li a href System configuration dll Download a li li a href Configurationmanager dll Download a li ul td tr tbody table p here for a quick overview of the site Help Center Detailed answers to any relatedl questions you might have Meta Discuss the workings

c# initialize component error

C Initialize Component Error table id toc tbody tr td div id toctitle Contents div ul li a href The Name Initializecomponent Does Not Exist Xamarin a li li a href The Name initializecomponent Does Not Exist In The Current Context Xamarin a li li a href Initializecomponent Does Not Exist In The Current Context C Xamarin a li ul td tr tbody table p here for a quick overview of the site Help Center Detailed answers to any questions you relatedl might have Meta Discuss the workings and policies of the name initializecomponent does not exist c this site

c# reference compiler error cs0103

C Reference Compiler Error Cs table id toc tbody tr td div id toctitle Contents div ul li a href Error Cs Unity a li li a href The Name Does Not Exist In The Current Context Mvc a li li a href Nameof Does Not Exist In The Current Context a li ul td tr tbody table p resources Windows Server resources Programs MSDN subscriptions Overview Benefits Administrators Students Microsoft Imagine Microsoft relatedl Student Partners ISV Startups TechRewards Events Community the name does not exist in the current context asp net c Magazine Forums Blogs Channel Documentation APIs and

c# error does not contain a static main method

C Error Does Not Contain A Static Main Method table id toc tbody tr td div id toctitle Contents div ul li a href Error Does Not Contain A Static main Method Suitable For An Entry Point a li li a href exe Does Not Contain A Static main Method Suitable For An Entry Point a li li a href Does Not Contain A Static Main Method C Console Application a li li a href Static Void Main string Args In C a li ul td tr tbody table p here for a quick overview of the site Help Center

compiler error message cs1061 mvc

Compiler Error Message Cs Mvc table id toc tbody tr td div id toctitle Contents div ul li a href Error Cs C a li li a href Cs asp default aspx Does Not Contain A Definition For a li li a href Does Not Contain A Definition For Are You Missing A Using Directive Or An Assembly Reference a li ul td tr tbody table p here for a quick overview relatedl of the site Help Center Detailed answers error cs does not contain a definition for to any questions you might have Meta Discuss the workings p h

compiler error message cs1061 accepting first argument type

Compiler Error Message Cs Accepting First Argument Type table id toc tbody tr td div id toctitle Contents div ul li a href Compiler Error Message Cs Does Not Contain A Definition For a li li a href Cs asp default aspx Does Not Contain A Definition For a li li a href Cs C a li ul td tr tbody table p here for a quick overview of the site Help Center Detailed answers to any questions relatedl you might have Meta Discuss the workings and policies does not contain a definition for and no extension method accepting a

compiler error message cs0117 does not contain a definition

Compiler Error Message Cs Does Not Contain A Definition table id toc tbody tr td div id toctitle Contents div ul li a href Error Cs Does Not Contain A Definition a li li a href Error Cs resource Does Not Contain A Definition For animation a li li a href Does Not Contain A Definition For Actionbarsize a li li a href Resource Does Not Contain A Definition For Animation Xamarin a li ul td tr tbody table p games PC games p h id Error Cs Does Not Contain A Definition p Windows games Windows phone games Entertainment

compiler error cs5001

Compiler Error Cs table id toc tbody tr td div id toctitle Contents div ul li a href Asp net Program Does Not Contain A Static main Method Suitable For An Entry Point a li li a href Does Not Contain A Static Main Method C Console Application a li li a href Program Does Not Contain A Static Main Method Visual Studio a li ul td tr tbody table p resources Windows Server resources Programs MSDN subscriptions Overview Benefits Administrators Students Microsoft Imagine Microsoft Student Partners ISV Startups TechRewards relatedl Events Community Magazine Forums Blogs Channel Documentation APIs error

cacheexception error configuring from null

Cacheexception Error Configuring From Null table id toc tbody tr td div id toctitle Contents div ul li a href Element cache Does Not Allow Attribute maxentrieslocalheap a li li a href Maxentrieslocalheap Vs Maxelementsinmemory a li li a href Ehcache Maxelementsinmemory a li ul td tr tbody table p here for a element defaultcache does not allow nested persistence elements quick overview of the site Help Center Detailed p h id Element cache Does Not Allow Attribute maxentrieslocalheap p answers to any questions you might have Meta Discuss the workings and p h id Maxentrieslocalheap Vs Maxelementsinmemory p policies

compilation error does not contain a definition

Compilation Error Does Not Contain A Definition table id toc tbody tr td div id toctitle Contents div ul li a href Error Cs Does Not Contain A Definition For a li li a href Cs asp default aspx Does Not Contain A Definition For a li li a href Does Not Contain A Definition For C a li li a href Does Not Contain A Definition For And No Extension Method Entity Framework a li ul td tr tbody table p resources Windows Server resources Programs MSDN subscriptions Overview Benefits Administrators Students Microsoft Imagine Microsoft relatedl Student Partners ISV

commons logging impl jdk14logger error

Commons Logging Impl Jdk logger Error table id toc tbody tr td div id toctitle Contents div ul li a href Org apache commons logging impl jdk logger Does Not Implement Log a li li a href Jdk Logging Configuration a li li a href Java Logging a li ul td tr tbody table p here for a quick overview of jdk logger configuration the site Help Center Detailed answers to any questions org apache commons logging impl log jlogger does not implement log you might have Meta Discuss the workings and policies of this site About p h id

column name does not belong to table error

Column Name Does Not Belong To Table Error table id toc tbody tr td div id toctitle Contents div ul li a href Column Does Not Belong To Underlying Table C a li li a href Column Does Not Belong To Table Sql a li ul td tr tbody table p here for a quick overview of the site Help Center Detailed answers to any questions you might have Meta Discuss the workings and policies relatedl of this site About Us Learn more about Stack Overflow the column does not belong to table c datatable company Business Learn more about

column does not belong to table error

Column Does Not Belong To Table Error table id toc tbody tr td div id toctitle Contents div ul li a href Column Does Not Belong To Referenced Table a li li a href Column Does Not Belong To Underlying Table C a li li a href Column column Name Does Not Belong To Table a li ul td tr tbody table p here for a quick overview of the site Help Center Detailed answers to any questions relatedl you might have Meta Discuss the workings and policies column does not belong to table c datatable of this site About

column does not belong to table random error

Column Does Not Belong To Table Random Error table id toc tbody tr td div id toctitle Contents div ul li a href Column Does Not Belong To Table Defaultview a li li a href Column Does Not Belong To Table Table C a li li a href Column Does Not Belong To Table Sql a li ul td tr tbody table p ACTIVITIES If this is your first visit be sure to check out the FAQ by clicking the link above You may have to register before relatedl you can post click the register link above to proceed To

cmake error the source directory does not appear to contain

Cmake Error The Source Directory Does Not Appear To Contain table id toc tbody tr td div id toctitle Contents div ul li a href Cmakelists txt Not Found a li li a href Does Not Appear To Contain Cmakelists txt Windows a li ul td tr tbody table p here for a quick overview of the site relatedl Help Center Detailed answers to any questions does not appear to contain cmakelists txt opencv you might have Meta Discuss the workings and policies of this does not appear to contain cmakelists txt ubuntu site About Us Learn more about Stack

cmake error the source directory does not appear

Cmake Error The Source Directory Does Not Appear table id toc tbody tr td div id toctitle Contents div ul li a href Cmake Add Source Directory a li li a href Cmake Debug Flags a li li a href Does Not Appear To Contain Cmakelists Txt Ubuntu a li ul td tr tbody table p here for a quick overview of the site Help Center Detailed answers to any questions you might have Meta Discuss relatedl the workings and policies of this site About Us Learn cmake source directory does not exist more about Stack Overflow the company Business

checkvirtualfileexists error

Checkvirtualfileexists Error table id toc tbody tr td div id toctitle Contents div ul li a href The File Does Not Exist At System Web Ui Util Checkvirtualfileexists Virtualpath Virtualpath a li ul td tr tbody table p here for a quick overview of the site Help relatedl Center Detailed answers to any questions you might p h id The File Does Not Exist At System Web Ui Util Checkvirtualfileexists Virtualpath Virtualpath p have Meta Discuss the workings and policies of this site About checkvirtualfileexists exception Us Learn more about Stack Overflow the company Business Learn more about hiring developers

crc error cs5001

Crc Error Cs table id toc tbody tr td div id toctitle Contents div ul li a href Does Not Contain A Static Main Method C Console Application a li li a href Visual Studio Program Does Not Contain A Static Main Method a li li a href C Main Method a li ul td tr tbody table p resources Windows Server resources Programs MSDN subscriptions Overview Benefits Administrators Students Microsoft Imagine Microsoft Student relatedl Partners ISV Startups TechRewards Events Community Magazine Forums error program does not contain a static main method suitable for an entry point Blogs Channel Documentation

create db database creation failed error role

Create Db Database Creation Failed Error Role table id toc tbody tr td div id toctitle Contents div ul li a href Createdb Database Creation Failed Error Permission Denied To Create Database a li li a href Pg insufficientprivilege Error Permission Denied To Create Database a li li a href Sudo Unknown User Postgres a li li a href Fatal Role Does Not Exist Rails a li ul td tr tbody table p here for a quick overview of the site Help Center Detailed answers relatedl to any questions you might have Meta Discuss the postgres role does not exist

createdb error

Createdb Error table id toc tbody tr td div id toctitle Contents div ul li a href Createdb Database Creation Failed Error Permission Denied To Create Database a li li a href Psql Fatal Database user Does Not Exist a li li a href Psql Fatal Role Does Not Exist Windows a li li a href Pg insufficientprivilege Error Permission Denied To Create Database a li ul td tr tbody table p here for a quick overview of the site Help Center Detailed answers to any questions you might have relatedl Meta Discuss the workings and policies of this site

createdb database creation failed error

Createdb Database Creation Failed Error table id toc tbody tr td div id toctitle Contents div ul li a href Sudo Unknown User Postgres a li li a href Psql Fatal Role Does Not Exist Windows a li li a href Fatal Role Does Not Exist Rails a li ul td tr tbody table p dbname createdb -h host -p port -D datadir -u dbname relatedl Inputs -h host Specifies the hostname of the machine createdb database creation failed error permission denied to create database on which the postmaster is running Defaults to using a local Unix domain psql fatal

createdb database creation failed error role does not exist

Createdb Database Creation Failed Error Role Does Not Exist table id toc tbody tr td div id toctitle Contents div ul li a href Pg insufficientprivilege Error Permission Denied To Create Database a li li a href Sudo Unknown User Postgres a li ul td tr tbody table p here for a quick overview of the site Help Center Detailed answers to any questions you might have Meta Discuss the workings and policies of this site About Us Learn relatedl more about Stack Overflow the company Business Learn more about hiring developers psql fatal database username does not exist or

cs5001 error

Cs Error table id toc tbody tr td div id toctitle Contents div ul li a href Visual Studio Program Does Not Contain A Static Main Method a li li a href A Project With An Output Type Of Class Library Cannot Be Started Directly a li ul td tr tbody table p an entry point Visual relatedl Studio Languages NET Framework Visual C csc error cs Question Sign in to vote Trying to compile RemoteUpload cs error cs visual studio http code msdn microsoft com CSASPNETRemoteUploadAndDown-a b cb sourcecode fileId pathId using C WINDOWS Microsoft NET Framework v csc

csc error cs5001 program

Csc Error Cs Program table id toc tbody tr td div id toctitle Contents div ul li a href Asp net Program Does Not Contain A Static main Method Suitable For An Entry Point a li li a href Visual Studio Program Does Not Contain A Static Main Method a li li a href C Main Method a li li a href Metadata File Could Not Be Found a li ul td tr tbody table p resources Windows Server resources Programs MSDN subscriptions Overview Benefits Administrators Students Microsoft Imagine Microsoft Student Partners relatedl ISV Startups TechRewards Events Community Magazine Forums

data binding error

Data Binding Error table id toc tbody tr td div id toctitle Contents div ul li a href Databinding Does Not Contain A Property With The Name value a li li a href Databinding Does Not Contain A Property With The Name Drop Down List a li li a href Databinding system string Does Not Contain A Property With The Name a li ul td tr tbody table p resources Windows Server resources Programs MSDN subscriptions Overview Benefits Administrators Students Microsoft Imagine Microsoft Student Partners ISV Startups TechRewards relatedl Events Community Magazine Forums Blogs Channel Documentation APIs binding error sql

database connector error ora 04043

Database Connector Error Ora table id toc tbody tr td div id toctitle Contents div ul li a href Drop Package Ora- Object Does Not Exist a li li a href Ora Object Instances util Does Not Exist a li ul td tr tbody table p CommunityOracle User Group CommunityTopliners CommunityOTN Speaker BureauJava CommunityError You don't have JavaScript enabled This tool uses JavaScript and much of it will not work correctly without relatedl it enabled Please turn JavaScript back on and ora- object does not exist reload this page Please enter a title You can not post ora- sqlldr a

databinding error

Databinding Error table id toc tbody tr td div id toctitle Contents div ul li a href Socket Binding Error a li li a href Databinding Does Not Contain A Property With The Name Drop Down List a li li a href Databinding system string Does Not Contain A Property With The Name a li li a href Databinding system data datarowview Does Not Contain A Property With The Name a li ul td tr tbody table p ASP NET Community Standup Forums binding error sql Help Home ASP NET Forums Data Access DataSource Controls - SqlDataSource p h id

datarowview error

Datarowview Error table id toc tbody tr td div id toctitle Contents div ul li a href System data datarowview Does Not Contain A Property With The Name userid a li li a href Databinding system string Does Not Contain A Property With The Name a li li a href Does Not Contain A Property With The Name Drop Down List a li ul td tr tbody table p here for a quick overview of the site Help Center Detailed answers to any questions you might have Meta Discuss the workings and policies relatedl of this site About Us Learn

datagridview currencymanager error

Datagridview Currencymanager Error table id toc tbody tr td div id toctitle Contents div ul li a href Datagridview System indexoutofrangeexception Index Does Not Have A Value a li ul td tr tbody table p here for a quick overview of the site Help Center Detailed answers to any questions you might have Meta Discuss relatedl the workings and policies of this site About Us system windows forms datagridview datagridviewdataconnection geterror int rowindex Learn more about Stack Overflow the company Business Learn more about hiring developers or datagridviewrow index - c posting ads with us Stack Overflow Questions Jobs Documentation

datagridview error index 1 does not have a value

Datagridview Error Index Does Not Have A Value table id toc tbody tr td div id toctitle Contents div ul li a href System windows forms datagridview datagridviewdataconnection geterror int Rowindex a li li a href Datagridview Index Does Not Have A Value a li ul td tr tbody table p here for a quick overview of the site Help Center Detailed answers to any relatedl questions you might have Meta Discuss the workings and datagridviewrow index policies of this site About Us Learn more about Stack Overflow the system windows forms currencymanager get item int index company Business Learn

datarowview error in

Datarowview Error In table id toc tbody tr td div id toctitle Contents div ul li a href System data datarowview In Dropdownlist a li li a href Databinding system string Does Not Contain A Property With The Name a li li a href System data datarowview In Combobox C a li ul td tr tbody table p here for a quick overview of the site Help Center Detailed answers to any questions you might have Meta Discuss the workings and policies of relatedl this site About Us Learn more about Stack Overflow the company databinding system data datarowview does

db_execute sql execute error 3701

Db execute Sql Execute Error table id toc tbody tr td div id toctitle Contents div ul li a href Error Sql Server a li li a href Error Cannot Drop The Database a li li a href Cannot Drop The Database Because It Does Not Exist Or You Don t Have Permission a li li a href User Does Not Have Permission To Alter Database Or The Database Does Not Exist a li ul td tr tbody table p here for a quick overview of the site Help Center Detailed answers to any questions you might have Meta Discuss

blend error does not exist in the namespace

Blend Error Does Not Exist In The Namespace table id toc tbody tr td div id toctitle Contents div ul li a href The Type Or Namespace Name Linq Does Not Exist In The Namespace System a li li a href The Type Or Namespace Name Mvc Does Not Exist In The Namespace System Web a li ul td tr tbody table p here for a quick overview of the site relatedl Help Center Detailed answers to any questions you does not exist in the namespace are you missing an assembly reference might have Meta Discuss the workings and policies

blend namespace error

Blend Namespace Error table id toc tbody tr td div id toctitle Contents div ul li a href The Tag Does Not Exist In Namespace a li li a href Does Not Exist In The Namespace Are You Missing An Assembly Reference a li li a href The Name Does Not Exist In The Namespace Clr-namespace Wpf C a li ul td tr tbody table p here for a relatedl quick overview of the site Help Center the name does not exist in the namespace clr-namespace wpf Detailed answers to any questions you might have Meta Discuss p h id

caused by org.postgresql.util.psqlexception error relation does not exist

Caused By Org postgresql util psqlexception Error Relation Does Not Exist table id toc tbody tr td div id toctitle Contents div ul li a href Org postgresql util psqlexception Error Column Does Not Exist a li li a href Org postgresql util psqlexception Error Schema Does Not Exist a li li a href Hibernate Column Of Relation Does Not Exist a li li a href Hibernate Org postgresql util psqlexception Error Column Does Not Exist a li ul td tr tbody table p here for a quick overview of the site Help Center Detailed relatedl answers to any questions