Home > invalid argument > 22 argument error grabber invalid obclient

22 argument error grabber invalid obclient

Products NoMachine Terminal Server Products General Discussions Log in Login to the forums Register to the network error invalid argument putty forums Error is 22: Invalid argument Home / Forums / ssh_dispatch_run_fatal invalid argument NoMachine for Linux / Error is 22: Invalid argument Forum: NoMachine for LinuxTagged:Error 22: Invalid Argument, putty gethostbyname unknown error NX, SSH This topic contains 1 reply, has 2 voices, and was last updated by Britgirl 2 years, 8 months ago. Author Posts January 20, ssh_init: network error: invalid argument 2014 at 12:16 #1747 sbc-randomParticipant I have upgraded from 3.x Free to 4.0 Workstation. I'm not even able to connect any more. If I try via NX I get the following: Info: Starting NoMachine version 4.0.369. Info: Loading settings from ‘.nx/config/nxplayer.cfg'. 10416 10416 23:02:54 563.688 Main: Creating the client session. 10416 10416

Error Is 107: Connection Refused

23:02:54 563.739 ClientSession: Initializing session at 0x10f0f60. 10416 10416 23:02:54 563.768 ClientSession: Change state to ‘Initializing'. 10416 10416 23:02:54 563.831 ClientSession: Created new view at 0x10f1e80 with label ‘MainWindowView' and value ‘0x60760c'. 10416 10416 23:02:54 593.475 ClientSession: Created new view at 0x11065b0 with label ‘MenuPanelView' and value ‘0x60760c'. 10416 10416 23:02:54 653.742 ClientSession: Created new view at 0x13a20f0 with label ‘SessionWizardView' and value ‘0x60760c'. 10416 10416 23:02:54 722.768 ClientSession: Change state to ‘Initialized'. 10416 10416 23:02:54 723.972 ClientSession: Initialized session at 0x10f0f60. 10416 10416 23:02:54 724.038 Main: Entering the GUI event loop. 10416 10416 23:02:54 772.886 ClientSession: Going to handle running children. 10416 10416 23:02:57 045.773 ClientSession: Starting session at 0x10f0f60. 10416 10416 23:02:57 045.829 ClientSession: Change state to ‘Starting'. 10416 10416 23:02:57 047.024 ClientSession: Going to start session ‘/home/zzz/.nx/config/220.233.200.118.nxs'. 10416 10416 23:02:57 060.804 Connection: Disabling interactive session. 10416 10416 23:02:57 060.829 ClientSession: Created local '10' and remote '11' descriptors for th

Support Search GitHub This repository Watch 2 Star 3 Fork 5 jmonlong/sQTLseekeR Code Issues 1 Pull requests 0 Projects 0 Pulse Graphs New issue Error with index.genotype command. Error in file.exists(file)

Putty Error Unable To Open Connection

: invalid 'file' argument #1 Open TobyGurran opened this Issue Jun 5, 2016 · nomachine 1 comment Projects None yet Labels None yet Milestone No milestone Assignees No one assigned 2 participants TobyGurran commented Jun download putty 5, 2016 Dear Dr Monlong, Many thanks for publishing and making available such an interesting and useful package! I find splice QTLs very interesting and would very much like to identify and study some from https://www.nomachine.com/forums/topic/error-is-22-invalid-argument my cancer dataset. I have encountered an error with the index.genotype command which I hope you will be able to help me with. As per the instructions on your sQTLseekeR Github page, https://github.com/jmonlong/sQTLseekeR, I have prepared my genotype information as described, with chromosome, snp start, snp end, snpID, then my samples with genotypes coded 0,1,2,(-1 for missing): output_Reference_file_Transpose_a2Version_CHR_22.traw[1:3,1:7] chr start end snpId sample1 sample2 sample3 1 22 16054311 16054311 https://github.com/jmonlong/sQTLseekeR/issues/1 rs102459 2 2 2 2 22 16054713 16054713 rs230493 2 2 2 3 22 16066757 16066757 rs356385 2 2 2 However when I try and run the index.genotype command as per the "run-example" page, https://github.com/jmonlong/sQTLseekeR/blob/master/scripts/run-example.R, I get the following error: CHR_22.indexed <- index.genotype(output_Reference_file_Transpose_a2Version_CHR_22.traw) Error in file.exists(file) : invalid 'file' argument Do have any suggestions as to why this could be? Admittedly the file I am running the command on contains information from chromosome 22 (I decided to run on a small subset first). Could this be confusing the programme by it not containing every chromosome? I am sure that I have created the strcture of the file correclty, because if I use a file which does not have the correct number of input columns as is stipulated in the instructions, I get a different error telling me that those columns are missing. genotype.indexed.f <- index.genotype(incorrect.table) Error in index.genotype(genotype.f) : Missing column or in incorrect order. The first 4 columns must be 'chr', 'start', 'end' and 'snpId'. Could it also be that my data is not in the correct format? Is the data required to be in .tsv format? Because the run-example page reads: genotype.f="snps-012coded.tsv" #1) Index the genotype file (if not done externally before) genotype.ind

'q1.txt' > AS mp1, mp2 > CLUSTER BY mp1) map_output > INSERT OVERWRITE TABLE t3 > REDUCE map_output.mp1 > USING https://qnalist.com/questions/117179/error-while-running-hive-query 'retrieve' > AS reducef1;* Total MapReduce jobs = 1 Launching Job 1 out of 1 Number of reduce tasks not specified. Estimated from input data size: https://codegists.com/search/asynchronous-examples/386 1 In order to change the average load for a reducer (in bytes): set hive.exec.reducers.bytes.per. reducer= In order to limit the maximum number of reducers: set hive.exec.reducers.max= invalid argument In order to set a constant number of reducers: set mapred.reduce.tasks= Starting Job = job_201112281627_0100, Tracking URL = http://localhost:50030/jobdetails.jsp?jobid=job_201112281627_0100 Kill Command = /home/hadoop/hadoop-0.20.2-cdh3u2//bin/hadoop job -Dmapred.job.tracker=localhost:54311 -kill job_201112281627_0100 2011-12-31 04:34:52,208 Stage-1 map = 0%, reduce = 0% 2011-12-31 04:35:52,939 Stage-1 map = 0%, reduce = 0% 2011-12-31 04:36:34,097 Stage-1 map = 100%, reduce = 100% 22 argument error Ended Job = job_201112281627_0100 with errors FAILED: Execution Error, return code 2 from org.apache.hadoop.hive.ql.exec.MapRedTask hive>*In 'q1.txt' (text file) I have written query in Hive which returns 2 columns and In 'retrieve' I have wriiten a java code which takes 2 input and display the 1 column*Is there any mistake in query.*This are my logs, related to my execution of Hive query.*2011-12-31 04:34:17,604 WARN mapred.JobClient (JobClient.java: copyAndConfigureFiles(649)) - Use GenericOptionsParser for parsing the arguments. Applications should implement Tool for the same. 2011-12-31 04:36:35,357 ERROR exec.MapRedTask (SessionState.java:printError(343)) - Ended Job = job_201112281627_0100 with errors 2011-12-31 04:36:38,112 ERROR ql.Driver (SessionState.java:printError(343)) - FAILED: Execution Error, return code 2 from org.apache.hadoop.hive.ql.exec.MapRedTask 2011-12-31 05:37:34,750 WARN mapred.JobClient (JobClient.java:copyAndConfigureFiles(649)) - Use GenericOptionsParser for parsing the arguments. Applications should implement Tool for the same. 2011-12-31 05:42:58,176 ERROR exec.MapRedTask (SessionState.java:printError(343)) - Ended Job = job_201112281627_0101 with errors 2011-12-31 05:43:16,748 ERROR ql.Driver (SessionState.java:printError(343)) - FAILED: Execution Error, return code 2 from org.apache.hadoop.hive.ql.exec.MapRedTask 2011-12-31 06:40:31,764 WARN mapred.JobClient (JobClient.java:copyAndConfigureFiles(649)) - Use Generi

proxy = require('proxy-middleware'); import { join } from 'path'; import { argv } from 'yargs'; import { SeedConfig } from './seed.config'; /** * This class extends the basic seed configuration, allowing for project specific overrides. A few examples can be found * below. */ export class ProjectConfig extends SeedConfig { PROJECT_TASKS_DIR = join(process.cwd(), this.TOOLS_DIR, 'tasks', 'project'); constructor() { super(); /* Enable typeless compiler runs (faster) between typed compiler runs. */ // this.TYPED_COMPILE_INTERVAL = 5; // Add `NPM` third-party libraries to be injected/bundled. this.NPM_DEPENDENCIES = [ ...this.NPM_DEPENDENCIES, // {src: 'jquery/dist/jquery.min.js', inject: 'libs'}, // {src: 'lodash/lodash.min.js', inject: 'libs'}, ]; // Add `local` third-party libraries to be injected/bundled. this.APP_ASSETS = [ ...this.APP_ASSETS, // {src: `${this.APP_SRC}/your-path-to-lib/libs/jquery-ui.js`, inject: true, vendor: false} // {src: `${this.CSS_SRC}/path-to-lib/test-lib.css`, inject: true, vendor: false}, ]; /* Add to or override NPM module configurations: */ // this.mergeObject(this.PLUGIN_CONFIGS['browser-sync'], { ghostMode: false }); this.PLUGIN_CONFIGS['browser-sync']= { port: this.PORT, startPath: this.APP_BASE, server: { baseDir: `${this.DIST_DIR}/empty/`, middleware: [ proxy({ protocol: 'http:', hostname: 'localhost', port: 8081, pathname: '/api', route: '/api' }), require('connect-history-api-fallback')({ index: `${this.APP_BASE}index.html` }) ], routes: { [`${this.APP_BASE}${this.APP_DEST}`]: this.APP_DEST, [`${this.APP_BASE}node_modules`]: 'node_modules', [`${this.APP_BASE.replace(/\/$/, '')}`]: this.APP_DEST } } }; } } Project specific browsersync configuration with reverse proxy ( manastungare/css-compress.php ( php) */ /* Add your CSS files to this array (THESE ARE ONLY EXAMPLES) */ $cssFiles = array( "ads.css"

 

Related content

cp invalid argument error

cp invalid argument error p here for a quick overview of the site Help Center Detailed answers to any questions you might have Meta Discuss Linux Copy Invalid Argument the workings and policies of this site About Us Learn more about linux cp invalid argument Stack Overflow the company Business Learn more about hiring developers or posting ads with us Super User Questions Aws S Cp Invalid Argument Type Tags Users Badges Unanswered Ask Question Super User is a question and answer site for computer enthusiasts and power users Join them it only takes a minute Sign cp cannot create

code 0 error message invalid argument

code error message invalid argument p here for a quick overview of the site Help Center Detailed answers to any questions you might have Meta Discuss the workings and policies of this site About Us Learn more about Stack Overflow the company Business Learn more about hiring developers or posting ads with x - javascript runtime error invalid argument us Stack Overflow Questions Jobs Documentation Tags Users Badges Ask Question x Dismiss Join the Stack Javascript Invalid Argument Exception Overflow Community Stack Overflow is a community of million programmers just like you helping each other Join them it only takes

command mkdir error invalid argument

command mkdir error invalid argument p here for a quick overview of the site Help Center Detailed answers to any questions you might have Meta Discuss the workings and policies of this site About Us Learn more about Stack Overflow the company Business mkdir invalid argument laravel Learn more about hiring developers or posting ads with us Stack Overflow Questions Jobs Documentation mkdir cannot create directory invalid argument Tags Users Badges Ask Question x Dismiss Join the Stack Overflow Community Stack Overflow is a community of million programmers just like Linux Mkdir Invalid Argument you helping each other Join them

chrome error 4 invalid argument

chrome error invalid argument p from GoogleSign inHidden fieldsSearch for groups or messages p p Support Search GitHub This repository Watch Star Fork google google-visualization-issues Code Issues Pull requests Projects Pulse Graphs New issue Error Message Invalid Argument Closed orwant opened this Issue May middot comments Projects None yet Labels Priority-Medium Type-Defect Milestone No milestone Assignees orwant participant orwant commented May I have been using Alexander Bautz Google Visualisation suite for SharePoint for the past few months successfully for our online dashboards Today some of the graphs failed to resolve on the page producing the Invalid Argument error message This

crm invalid argument error

crm invalid argument error p for Enterprise Skype for business Microsoft Dynamics Microsoft Dynamics Sales Service Marketing Social Enterprise Resource Planning Small and Midsize Business Windows Windows for dynamics crm update business Windows for Internet of Things Windows devices Data and The Specified Record Type Does Not Exist In Microsoft Dynamics Crm analytics Data management and analytics Microsoft SQL Server Microsoft Power BI Microsoft Cortana Intelligence Suite Operations management crm rollups Operations Management Suite System Center Sign in Search Microsoft Search Dynamics Community Participate Ask a Question Get Started Badges Earn Badges View Badges Leaderboards Compete on Leaderboards View mscrmkeygenerator

crystal reports error an invalid argument was encountered

crystal reports error an invalid argument was encountered p for Help Receive Real-Time Help Create a Freelance Project Hire for a Full Time Job Ways to Get Help Ask a Question Ask for Help Receive Real-Time Help Create a Freelance Project Hire for a Full Time Job Ways to crystal reports an invalid argument was encountered saving Get Help Expand Search Submit Close Search Login Join Today Products BackProducts Gigs Live Invalid Argument Provided Error Crystal Reports Careers Vendor Services Groups Website Testing Store Headlines Experts Exchange Questions an invalid argument was encountered Want to Advertise Invalid Argument For Database

crystal report error invalid argument for database

crystal report error invalid argument for database p productResults length resourceResults length 'See all Search Results' 'Full site search' CA Support Online Support by Product Support by Product Invalid argument for database error when requesting one Audit Details Report or other Audit reports Document ID TEC Last Modified Date active 'Hide' 'Show' Technical invalid argument provided error crystal reports Document Details Products CA Identity Manager Releases CA Identity Manager Release CA Identity Manager Release SP crystal report viewer invalid argument provided CA Identity Manager Release SP Components IdentityMinder Identity Manager IDMGR BUSINESS INTELLIGENCE EMBEDDING KIT CABOXI When asking for one

crystal reports invalid argument for database error

crystal reports invalid argument for database error p SQL Server Express resources Windows Server resources Programs MSDN subscriptions Overview Benefits Administrators Students Microsoft Imagine Microsoft Student Partners ISV Error In File Invalid Argument For Database Startups TechRewards Events Community Magazine Forums Blogs Channel Documentation crystal reports ung ltiges argument f r die datenbank APIs and reference Dev centers Retired content Samples We re sorry The content you requested has rpt invalid argument for database been removed You ll be auto redirected in second Ask a question Quick access Forums home Browse forums users FAQ Search related threads Remove From Invalid

crystal reports invalid argument error

crystal reports invalid argument error p Dec Location United States Online Status Offline Posts Topic Invalid Argument ProvidedPosted Feb at am Hello This question may be too general to answer but if someone could offer any guess Crystal Reports Error Invalid Argument Provided or suggestion it would be appreciated I have a report that was working crystal reports an invalid argument was encountered saving fine that is suddenly no longer running giving me an error message that states Invalid Argument Provided I get no invalid argument for database crystal reports follow-up message to tell me what the Invalid Argument is

crystal reports error invalid argument provided

crystal reports error invalid argument provided p for Help Receive Real-Time Help Create a Freelance Project Hire for a Full Time Job Ways to Get Help Ask a Question Ask for Help Receive Real-Time Help Create a Freelance Project Hire for a crystal reports xi invalid argument provided Full Time Job Ways to Get Help Expand Search Submit Close Search Crystal Reports Invalid Argument For Database Login Join Today Products BackProducts Gigs Live Careers Vendor Services Groups Website Testing Store Headlines Experts Exchange Questions syspro invalid argument provided Crystal Reports Invalid Argument provided Want to Advertise Here Solved Crystal Reports

cuda error file invalid argument

cuda error file invalid argument p here for a quick overview of the site Help Center Detailed answers to any questions you might Cuda Invalid Argument Kernel Call have Meta Discuss the workings and policies of this site cudamalloc invalid argument About Us Learn more about Stack Overflow the company Business Learn more about hiring developers or posting Invalid Argument Cudamemcpy ads with us Stack Overflow Questions Jobs Documentation Tags Users Badges Ask Question x Dismiss Join the Stack Overflow Community Stack Overflow is a community of cuda error invalid configuration argument million programmers just like you helping each other

cuda error invalid argument

cuda error invalid argument p here for a quick overview of the site Help Center Detailed answers to any questions you might have Meta Discuss the workings and policies invalid argument cuda memcpy of this site About Us Learn more about Stack Overflow the company Cuda Kernel Invalid Argument Business Learn more about hiring developers or posting ads with us Stack Overflow Questions Jobs Documentation Tags Users Badges cuda invalid configuration argument Ask Question x Dismiss Join the Stack Overflow Community Stack Overflow is a community of million programmers just like you helping each other Join them it only takes

cuda runtime error invalid argument 11

cuda runtime error invalid argument p here for a quick overview of the site Help Center Detailed answers to any questions you might have Meta Discuss the workings and policies of this site About Cuda Runtime Error Unspecified Launch Failure Us Learn more about Stack Overflow the company Business Learn more about hiring cuda runtime error unknown error developers or posting ads with us Stack Overflow Questions Jobs Documentation Tags Users Badges Ask Question x Dismiss Join the cuda invalid argument kernel Stack Overflow Community Stack Overflow is a community of million programmers just like you helping each other Join

cuda invalid argument error

cuda invalid argument error p here for a quick overview of the site Help Center Detailed answers to any questions you might have Meta Discuss the workings Cuda Kernel Invalid Argument and policies of this site About Us Learn more about Stack Overflow cuda error invalid configuration argument the company Business Learn more about hiring developers or posting ads with us Stack Overflow Questions Jobs Documentation Cuda Error Invalid Argument Tags Users Badges Ask Question x Dismiss Join the Stack Overflow Community Stack Overflow is a community of million programmers just like you helping each other Join them cudamalloc invalid

bluetooth error an invalid argument was supplied

bluetooth error an invalid argument was supplied p Boot and Lockup nbsp Notebook Wireless and Networking nbsp Notebook Audio nbsp Notebook Video Display and Touch nbsp Notebook Hardware and Upgrade Questions nbsp Notebook php error invalid argument supplied for foreach Software and How To Questions nbsp Business Notebooks nbsp Printers sprocket nbsp Inkjet error an invalid argument was supplied Printing nbsp LaserJet Printing nbsp Printer Software and Drivers nbsp DesignJet Large Format Printers and Digital Press nbsp HP Connected Invalid Argument Supplied For Foreach Wordpress Mobile Printing and Cloud Printing nbsp Scanning Faxing and Copying nbsp JetAdvantage Printing Applications and

bluetooth error invalid argument

bluetooth error invalid argument p Acer Asus or a custom build We also provide an extensive Windows tutorial section that covers a wide range of tips and tricks Windows Help Forums Windows bluetooth invalid argument supplied help and support Hardware Devices raquo User Name Remember Me Password Advanced Search Weblogic security utils adminaccount Error Invalid Arguments Show Threads Show Posts Advanced Search Go to Page Windows bluetooth error Dec ali sehran windows bluetooth file transfer not completed windows professionals x posts lahore pakistan bluetooth error i have hp p with window x from few weeks i cant transfer any file

echo write error invalid argument

echo write error invalid argument p here for a quick overview of the site Help Center Detailed answers to any questions you might have Meta Discuss the workings and policies of this site About Us Learn more about Stack Overflow the company Business Learn echo write to failed invalid argument more about hiring developers or posting ads with us Stack Overflow Questions Jobs Documentation Tags Fatal Write Error Invalid Argument Users Badges Ask Question x Dismiss Join the Stack Overflow Community Stack Overflow is a community of million programmers just like you git write error invalid argument helping each other

error 10022 an invalid argument was supplied

error an invalid argument was supplied p Sign in Pricing Blog Support Search GitHub option form This repository Watch Star Fork npm npm Ipsec Error An Invalid Argument Was Supplied Code Issues Pull requests Projects Wiki Pulse invalid argument supplied for foreach wordpress Graphs New issue Getting an error while executing npm on Windows Closed harry ster opened Invalid Argument Supplied For Foreach Laravel this Issue Oct middot comments Projects None yet option form Labels support option form Milestone No milestone option form Assignees No one assigned participants harry ster invalid argument supplied for foreach in form type checkboxes value

error 10022 python

error python p here for a quick overview of the site Help Center Detailed answers to any questions you might have Meta Discuss the workings socket error errno invalid argument python and policies of this site About Us Learn more about Stack Overflow socket error errno an invalid argument was supplied the company Business Learn more about hiring developers or posting ads with us Stack Overflow Questions Jobs Documentation python winerror Tags Users Badges Ask Question x Dismiss Join the Stack Overflow Community Stack Overflow is a community of million programmers just like you helping each other Join them it

error 10022 invalid argument supplied

error invalid argument supplied p Studio products Visual Studio Team Services Visual Studio Code Visual Studio Dev Essentials Office Office Word Excel PowerPoint Microsoft Graph Outlook OneDrive Sharepoint Skype Services Store Cortana Bing Application Insights Languages platforms Xamarin ASP NET C TypeScript NET - ipsec error an invalid argument was supplied VB C F Server Windows Server SQL Server BizTalk Server SharePoint Dynamics Programs Invalid Argument Supplied For Foreach Wordpress communities Students Startups Forums MSDN Subscriber downloads Sign in Search Microsoft Search Windows Dev Center Windows Dev Center Explore What s Invalid Argument Supplied For Foreach Laravel new for Windows

error 22 invalid argument linux

error invalid argument linux p communities company blog Stack Exchange Inbox Reputation and Badges sign up log in tour help Tour Start here for a quick overview of the site Help Center Detailed answers to any questions you might have Meta Discuss the workings and policies of this site About oracle linux error invalid argument Us Learn more about Stack Overflow the company Business Learn more about hiring mount invalid argument linux developers or posting ads with us Ask Ubuntu Questions Tags Users Badges Unanswered Ask Question Ask Ubuntu is a linux mount failed invalid argument question and answer site

error 22 invalid argument on mac

error invalid argument on mac p enter a title You can not post a blank message Please type your message and try again This discussion is locked otheroom Level points Q Diskutil error on restore I'm rm invalid argument mac getting an error while attempting to do a disk to disk restore with Invalid Argument Mac Disk Utility Diskutil Here are the details - Dual ghz G OS gb RAM- Booted to the Tiger OS Error Invalid Argument Mac Zip instal CD Diskutil run from there- Restore attempted from internal system partition to external firewire driveI'm simply trying to create

error 22 invalid argument disk

error invalid argument disk p described in Recovering from a disaster I have got the following error Restore Failure An error occurred while copying invalid argument disk utility Invalid argument Does anybody got the same Any solution Thanks invalid argument disk utility scan image for restore for any feedback Mauro http www i-cherubini it mauro blog dnanian - - AMHi Mauro Have you mounted the image with File Open error invalid argument mac Disk Image and dragged the resulting volume not the image file into the source martigan - - AMHi Dave thanks for the hint As I was not

error 22 invalid argument

error invalid argument p communities company blog Stack Exchange Inbox Reputation and Badges sign up log in tour help Tour Start here for a quick overview of the site Help Center Detailed answers to any questions you might error invalid argument mac have Meta Discuss the workings and policies of this site About Error Invalid Argument Zip Us Learn more about Stack Overflow the company Business Learn more about hiring developers or posting ads with mount error invalid argument cifs us Ask Ubuntu Questions Tags Users Badges Unanswered Ask Question Ask Ubuntu is a question and answer site for Ubuntu

access 2003 error invalid argument

access error invalid argument p One games Xbox games PC weblogic security utils adminaccount error invalid arguments games Windows games Windows phone games Entertainment All access invalid argument to function Entertainment Movies TV Music Business Education Business Students Microsoft Access Invalid Argument educators Developers Sale Sale Find a store Gift cards Products Software services Windows Office Free downloads security Ms Access Invalid Argument Internet Explorer Microsoft Edge Skype OneNote OneDrive Microsoft Health MSN Bing Microsoft Groove Microsoft Movies TV Devices Xbox All Microsoft devices Microsoft Surface All Windows PCs tablets PC accessories Xbox games Microsoft Band Microsoft invalid argument examples

access 2003 invalid argument error 3001

access invalid argument error p One games Xbox games PC run time error invalid argument games Windows games Windows phone games Entertainment All runtime error Entertainment Movies TV Music Business Education Business Students ms access invalid argument educators Developers Sale Sale Find a store Gift cards Products Software services Windows Office Free downloads security runtime error invalid argument Internet Explorer Microsoft Edge Skype OneNote OneDrive Microsoft Health MSN Bing Microsoft Groove Microsoft Movies TV Devices Xbox All Microsoft devices Microsoft Surface All Windows PCs tablets PC accessories Xbox games Microsoft Band Microsoft Invalid Argument In Access Update Query Lumia All

access 2003 invalid argument error

access invalid argument error p be down Please try the request again Your cache administrator is webmaster Generated Fri Sep GMT by s hv squid p p Help Receive Real-Time Help Create a Freelance Project Hire for a Full Time Job Ways to Get Help Ask a Question Ask for Help Receive Real-Time Help Create a Freelance Project Hire Invalidargumentexception for a Full Time Job Ways to Get Help Expand Search Submit Close Search Login Join Today Products BackProducts Gigs Live Careers Vendor Services Groups Website Testing Store Headlines Experts Exchange Questions Invalid Argument Error Microsoft Access SP Want to

access database invalid argument error message

access database invalid argument error message p One games Xbox games PC invalid argument for database syspro games Windows games Windows phone games Entertainment All Invalid Argument For Database Business Objects Entertainment Movies TV Music Business Education Business Students Invalid Argument For Database Crystal Reports educators Developers Sale Sale Find a store Gift cards Products Software services Windows Office Free downloads security Invalid Argument Examples Internet Explorer Microsoft Edge Skype OneNote OneDrive Microsoft Health MSN Bing Microsoft Groove Microsoft Movies TV Devices Xbox All Microsoft devices Microsoft Surface All Windows PCs tablets PC accessories Xbox games Microsoft Band Microsoft invalidargumentexception

access invalid argument error 3001

access invalid argument error p here for a quick overview of the site Help Center Detailed answers to any questions you might have Meta Discuss the workings and policies of this site About Us Learn more about Stack Overflow the company Business Run Time Error Invalid Argument Learn more about hiring developers or posting ads with us Stack Overflow Questions Jobs Documentation access invalid argument to function Tags Users Badges Ask Question x Dismiss Join the Stack Overflow Community Stack Overflow is a community of million programmers just like Microsoft Access Invalid Argument you helping each other Join them it

access invalid argument error

access invalid argument error p be down Please try the request again Your cache administrator is webmaster Generated Thu Sep GMT by s hv squid p p soon Ruby coming soon Getting Started Code Samples Resources Patterns and Practices App Registration Tool Events Podcasts Training API Sandbox Videos Documentation Office Add-ins Office Add-in Availability Office Add-ins Changelog Microsoft Graph API Office Unix Invalid Argument Keychain Access Connectors Office REST APIs SharePoint Add-ins Office UI Fabric Submit to the Office access invalid procedure call or argument Store All Documentation https www yammer com http feeds feedburner com office fmNx Ask a

argument error invalid

argument error invalid p here for a quick invalid argument error access overview of the site Help Center Detailed answers error invalid argument javascript to any questions you might have Meta Discuss the workings and policies of invalid argument error ie this site About Us Learn more about Stack Overflow the company Business Learn more about hiring developers or posting ads with Java Invalid Argument Error us Stack Overflow Questions Jobs Documentation Tags Users Badges Ask Question x Dismiss Join the Stack Overflow Community Stack Overflow is a community of million programmers just like you helping each other Join them

bash echo write error invalid argument

bash echo write error invalid argument p here for a quick overview of the site Help Center Detailed answers to any questions you might have Meta Discuss the workings and policies of this site About Us Learn more about Stack Overflow the Echo Write To Failed Invalid Argument company Business Learn more about hiring developers or posting ads with us Super User Questions cat write error invalid argument Tags Users Badges Unanswered Ask Question Super User is a question and answer site for computer enthusiasts and power users Join fatal write error invalid argument them it only takes a minute

bittorrent error invalid argument

bittorrent error invalid argument p protection by CloudFlare Ray ID eb ce b c p p here for a quick overview of the site Help Center Detailed answers to any questions you might have Meta Discuss the workings and policies of this site About Us Learn more about Stack Overflow the company Business Learn more about hiring developers or posting ads with us Stack Overflow Questions Jobs Documentation Tags Users Badges Ask Question x Dismiss a href https forum transmissionbt com viewtopic php t https forum transmissionbt com viewtopic php t a Join the Stack Overflow Community Stack Overflow is

error =invalid argument git

error invalid argument git p here for a quick overview of the site Help Center Detailed answers to any questions you might have Meta Discuss the workings and policies of this site Git Clone Fatal Read Error Invalid Argument About Us Learn more about Stack Overflow the company Business Learn more about git unable to create file invalid argument hiring developers or posting ads with us Stack Overflow Questions Jobs Documentation Tags Users Badges Ask Question x Dismiss Git Pull Fatal Write Error Invalid Argument Join the Stack Overflow Community Stack Overflow is a community of million programmers just like

error = shmget 22 invalid argument

error shmget invalid argument p and shmget invalid argument size SafetyAsset NetworkAsset Operations and MaintenanceCommerceOverviewSubscription Billing shmget errno and Revenue ManagementMaster Data Management for CommerceOmnichannel CommerceFinanceOverviewAccounting and Financial shmat invalid argument CloseCollaborative Finance OperationsEnterprise Risk and ComplianceFinancial Planning and AnalysisTreasury and Financial Risk ManagementHuman ResourcesOverviewCore Human shmget error Resources and PayrollHuman Capital AnalyticsTalent ManagementTime and Attendance ManagementManufacturingOverviewManufacturing NetworkManufacturing OperationsResponsive ManufacturingMarketingOverviewMarket with Speed and AgilityUnique Customer ExperiencesReal-Time Customer InsightsR D EngineeringOverviewDesign NetworkDesign OrchestrationProject and Portfolio ManagementSalesOverviewCollaborative Quote to CashSales Force AutomationSales Performance Shmmax ManagementSelling Through Contact CentersServiceOverviewEfficient Field Service ManagementOmnichannel Customer ServiceTransparent Service Process and OperationsSourcing and ProcurementOverviewContingent Workforce ManagementDirect ProcurementSelf-Service

error an invalid argument was encountered

error an invalid argument was encountered p be down Please try the request again Your cache administrator is webmaster Generated Sat Oct GMT by s ac squid p p SERVICES Services Overview Education Services Business Critical Services Consulting Services Managed Services Appliance Services CUSTOMER CENTER Customer Center Support Community MyVeritas Customer Success Licensing Programs Licensing Process ABOUT About Corporate Profile Corporate Leadership Newsroom Research an invalid argument was encountered incredimail Exchange Investor Relations Careers Legal Contact Us English English Fran ais Deutsch Italiano an invalid argument was encountered solidworks Portugu s Espa ol USA Site Veritas Veritas PartnerNet GENERAL ERROR

error creating view invalid argument

error creating view invalid argument p Gui vs mkviewThis topic has been locked replies Latest Post - x f - - T Z by SystemAdmin Display ConversationsBy Date - of Previous Next SystemAdmin D XK Posts Pinned topic Unable To Create Invalid Argument View Creation - Gui vs mkview x f - - T Z Tags Answered question unable to create invalid argument disk utility This question has been answered Unanswered question This question has not been answered yet Hello Fellow ClearCase Unable To Create Dmg Invalid Argument Developers We have a Windows ClearCase CC server and users We had

error device-mapper reload ioctl failed invalid argument command failed

error device-mapper reload ioctl failed invalid argument command failed p ioctl failed Invalid argument Replies LVM Logical Volume Management is pretty amazing but when something goes wrong it's not easy to troubleshoot This is not the fault of the tools but a reflection that device-mapper resume ioctl on failed invalid argument unable to resume LVM is relatively new in Linux and not widely understood What I Tried to device-mapper reload ioctl failed invalid argument failed to suspend Do I tried to increase the size of a logical volume with the lvextend command lvextend --extents FREE dev VolumeGroup var lvcreate device-mapper

error device-mapper resume ioctl failed invalid argument

error device-mapper resume ioctl failed invalid argument p Red Hat Certificate System Red Hat Satellite Subscription Asset Manager Red Hat Update Infrastructure Red Hat Insights Ansible Tower Device-mapper Resume Ioctl On Failed Invalid Argument Unable To Resume by Red Hat Cloud Computing Back Red Hat CloudForms Red Hat device-mapper reload ioctl failed invalid argument OpenStack Platform Red Hat Cloud Infrastructure Red Hat Cloud Suite Red Hat OpenShift Container Platform Red lvcreate device-mapper resume ioctl on failed invalid argument Hat OpenShift Online Red Hat OpenShift Dedicated Storage Back Red Hat Gluster Storage Red Hat Ceph Storage JBoss Development and Management Back

error einval invalid argument nodejs

error einval invalid argument nodejs p Sign in Pricing Blog Support Search GitHub option form This repository Watch Star Fork nodejs node-v x-archive Code Issues Pull requests Projects Wiki Pulse invalid argument uv interface addresses Graphs New issue Can't launch node process from cygwin Closed leeight opened Nodejs Windows this Issue Nov middot comments Projects None yet option form Labels cygwin windows option form Milestone No milestone git bash option form Assignees No one assigned participants leeight commented Nov node net js this handle open options fd Error EINVAL invalid argument at new Socket net js at process stdin node

error einval invalid argument

error einval invalid argument p Sign in Pricing Blog Support Search GitHub option form This repository Watch Star Fork open failed einval invalid argument nodejs node-v x-archive Code Issues Pull requests Projects Wiki Java Io Syncfailedexception Fsync Failed Einval Invalid Argument Pulse Graphs New issue Can't launch node process from cygwin Closed leeight opened this Issue error einval entity client radosgw gateway exists but key does not match Nov middot comments Projects None yet option form Labels cygwin windows option form Milestone No milestone option form Assignees No one assigned participants leeight Invalid Argument Uv interface addresses commented Nov node

error errno 10022 an invalid argument was supplied

error errno an invalid argument was supplied p here for a quick overview of the site Help Center Detailed answers to any questions Socket error Errno An Invalid Argument Was Supplied you might have Meta Discuss the workings and policies of this socket error errno invalid argument site About Us Learn more about Stack Overflow the company Business Learn more about hiring developers socket error errno invalid argument python or posting ads with us Stack Overflow Questions Jobs Documentation Tags Users Badges Ask Question x Dismiss Join the Stack Overflow Community Stack Overflow is a Socket Error Invalid Argument community

error errno einval invalid argument

error errno einval invalid argument p here for a quick overview of the site Help Center Detailed answers to any questions you might have Meta Discuss the workings error while executing gem errno einval invalid argument actiondispatch routing mapper scoping and policies of this site About Us Learn more about Stack Overflow Socket Error Errno Invalid Argument the company Business Learn more about hiring developers or posting ads with us Stack Overflow Questions Jobs Documentation Tags open failed einval invalid argument Users Badges Ask Question x Dismiss Join the Stack Overflow Community Stack Overflow is a community of million programmers

error execution invalid argument to function

error execution invalid argument to function p CommunityCategoryBoardLibraryUsers input input turn on suggestions Auto-suggest helps you quickly narrow down your search results by suggesting possible matches as you type Showing results for Search instead for Do you mean Find a invalid argument to function input Community Communities Welcome Getting Started Community Memo Community Matters Community Suggestion Invalid Argument To Function Input Sas Box Have Your Say SAS Programming Base SAS Programming SAS Procedures ODS and Base Reporting SAS GRAPH and ODS Invalid Argument To Function Input At Line Sas Graphics General SAS Programming SAS Studio Data Management SAS Data Management

error in accept invalid argument

error in accept invalid argument p here for a quick overview of the site Help Center Detailed answers to any questions you might have Meta Discuss the workings and c accept example policies of this site About Us Learn more about Stack Overflow the company Listen Invalid Argument Business Learn more about hiring developers or posting ads with us Stack Overflow Questions Jobs Documentation Tags Users c accept function Badges Ask Question x Dismiss Join the Stack Overflow Community Stack Overflow is a community of million programmers just like you helping each other Join them it only takes a Accept

error in function getsockname invalid argument

error in function getsockname invalid argument p here for a quick overview of the site Help Center Detailed answers to any questions you error getpeername invalid argument might have Meta Discuss the workings and policies of this site getpeername failed error was invalid argument About Us Learn more about Stack Overflow the company Business Learn more about hiring developers or shadowsocks getpeername invalid argument posting ads with us Stack Overflow Questions Jobs Documentation Tags Users Badges Ask Question x Dismiss Join the Stack Overflow Community Stack Overflow is a community of Struct Sockaddr million programmers just like you helping each

error in file invalid argument for database

error in file invalid argument for database p productResults length resourceResults length 'See all Search Results' 'Full site search' CA Support Online Support by Product Support by Product Invalid argument for database error when requesting Crystal Reports Invalid Argument For Database Error one Audit Details Report or other Audit reports Document ID TEC rpt invalid argument for database Last Modified Date active 'Hide' 'Show' Technical Document Details Products CA Identity Manager error in file file rt invalid description argument Releases CA Identity Manager Release CA Identity Manager Release SP CA Identity Manager Release SP Components IdentityMinder Identity Manager IDMGR BUSINESS

error in file tmp.rpt invalid argument for database

error in file tmp rpt invalid argument for database p productResults length resourceResults length 'See all Search Results' 'Full site search' CA Support Online Support by Product Support by Product Invalid argument for database error when requesting one crystal reports invalid argument for database Audit Details Report or other Audit reports Document ID TEC Last Invalid Argument Provided Error Crystal Reports Modified Date active 'Hide' 'Show' Technical Document Details Products CA Identity Manager Releases invalid argument for database syspro CA Identity Manager Release CA Identity Manager Release SP CA Identity Manager Release SP Components IdentityMinder Identity Manager IDMGR BUSINESS INTELLIGENCE

error in file .rpt invalid argument for database

error in file rpt invalid argument for database p productResults length resourceResults length 'See all Search Results' 'Full site search' CA Support Online Support by Product Support by Product Invalid argument for database error when requesting one Audit Details Report or other Audit reports Document ID TEC Last Modified Date active 'Hide' 'Show' Technical Document crystal reports invalid argument for database Details Products CA Identity Manager Releases CA Identity Manager Release CA Identity Manager Release SP Invalid Argument Provided Error Crystal Reports CA Identity Manager Release SP Components IdentityMinder Identity Manager IDMGR BUSINESS INTELLIGENCE EMBEDDING KIT CABOXI When asking for

error in rtable product invalid arguments

error in rtable product invalid arguments p MapleSim Academic MapleSim Server MapleSim Modelica Engine Connectors Component Libraries Online Education Maple T A - Testing Assessment Maple T A MAA Placement Test truth table invalid argument Suite M ouml bius - Online Courseware Other Products Toolboxes Valid Or Invalid Argument Truth Table Connectors E-Books Study Guides Professional Services Partnerships and OEM Opportunities Solutions Education Mathematics Education Engineering Education High Schools Two-Year Colleges Testing Assessment Developmental Math Students Applied Research Financial Modeling Operations Research High Performance Computing Physics Life Sciences Virtual Prototyping Engineering Industry Solutions Manufacturing Mining Oil Production Equipment Aircraft Systems

error inserting module invalid argument

error inserting module invalid argument p here for a quick overview of the site Help Center Detailed answers to any questions you might have insmod error could not insert module invalid parameters Meta Discuss the workings and policies of this site About Us Learn Modprobe Invalid Argument more about Stack Overflow the company Business Learn more about hiring developers or posting ads with us modprobe error could not insert nvidia uvm invalid argument Stack Overflow Questions Jobs Documentation Tags Users Badges Ask Question x Dismiss Join the Stack Overflow Community Stack Overflow is a community of million programmers just like

error inserting iwl3945 invalid argument

error inserting iwl invalid argument p AMSo here it goes I have this extremely annoying problem with my wireless adapter that s just making me seriously consider jumping off a bridge or even worse switching back to insmod error could not insert module invalid parameters windows P This is my setup Ubuntu wireless adapter intel PRO Wireless ABG Insmod Invalid Argument Golan Wireless driver iwl Wireless router Dlink DIR- with dd-wrt wirelessly connected laptops of them have windows and modprobe invalid argument is with ubuntu and one desktop pc with wired connection The problem is poor wireless performance of the

error inserting ath5k invalid argument

error inserting ath k invalid argument p here for a quick overview of the site Help Center Detailed modprobe invalid argument answers to any questions you might have Meta Discuss the workings Insmod Invalid Parameters and policies of this site About Us Learn more about Stack Overflow the company Business Disagrees About Version Of Symbol Learn more about hiring developers or posting ads with us Unix Linux Questions Tags Users Badges Unanswered Ask Question Unix Linux Stack Exchange is a question and answer site for users of Linux FreeBSD and other Un x-like operating systems Join them it only takes

error invalid argument during seek for read on /dev/sdb

error invalid argument during seek for read on dev sdb p communities company blog Stack Exchange Inbox Reputation and Badges sign up log in tour help Tour Start here for a quick overview of the site Help Center Detailed answers to any questions you might have Meta Discuss the workings and policies of this site About Us Learn more about Stack Overflow the company Business Learn more about invalid argument during seek for read on dev sda hiring developers or posting ads with us Ask Ubuntu Questions Tags Users Badges Unanswered Ask Question Invalid Argument During Seek For Read Gparted

error invalid argument

error invalid argument p here for a quick overview of the site Help Center Detailed answers to any questions you might have Meta Discuss the workings and policies of this site About Us Learn more about Stack Overflow the company Business Learn Error Invalid Argument -std gnu Not Allowed With c objc more about hiring developers or posting ads with us Stack Overflow Questions Jobs Documentation Tags error invalid argument -std c not allowed with c objc Users Badges Ask Question x Dismiss Join the Stack Overflow Community Stack Overflow is a community of million programmers just like you error

error invalid argument during seek for read on

error invalid argument during seek for read on p communities company blog Stack Exchange Inbox Reputation and Badges sign up log in tour help Tour Start here for a quick overview of the site Help Center Detailed answers to any questions you might have Meta Discuss the workings and policies of this site About Us Learn more invalid argument during seek for read gparted about Stack Overflow the company Business Learn more about hiring developers or posting ads invalid argument during seek for read on dev sda with us Ask Ubuntu Questions Tags Users Badges Unanswered Ask Question Ask Ubuntu

error invalid argument ie 9

error invalid argument ie p here for a quick overview of the site Help Center Detailed answers to any questions you might have Meta Discuss the workings and policies of this site About Ie Window open Invalid Argument Us Learn more about Stack Overflow the company Business Learn more about hiring weblogic security utils adminaccount error invalid arguments developers or posting ads with us Stack Overflow Questions Jobs Documentation Tags Users Badges Ask Question x Dismiss Join Ie Invalid Argument the Stack Overflow Community Stack Overflow is a community of million programmers just like you helping each other Join them

error invalid argument internet explorer

error invalid argument internet explorer p here for a quick overview of the site Help Center Detailed answers to any questions you might have Meta Discuss the workings Ie Invalid Argument and policies of this site About Us Learn more about Stack Overflow ie invalid argument the company Business Learn more about hiring developers or posting ads with us Stack Overflow Questions Jobs Documentation Tags Ie Invalid Argument Users Badges Ask Question x Dismiss Join the Stack Overflow Community Stack Overflow is a community of million programmers just like you helping each other Join them it only ie window open

error making tracking request java.net.socketexception invalid argument connect

error making tracking request java net socketexception invalid argument connect p the forums is now closed You can post and answer support requests on the new support site here Invalid argument connect java net SocketException Invalid argument soapui java net socketexception invalid argument create connect Discussion in ' Archived Tech Support' started by Slymeister Apr java net socketexception invalid argument create tomcat Thread Status Not open for further replies Slymeister New Member Since march st I have been receiving the Invalid Eclipse Java net socketexception Invalid Argument Create argument connect java net SocketException Invalid argument connect error every time I

error message an invalid argument was encountered

error message an invalid argument was encountered p be down Please try the request again Your cache administrator is webmaster Generated Wed Oct GMT by s ac squid p p this site Internet Explorer and above Upgrade Now Google Chrome Download Install Chrome Mozilla Firefox Download Install An Invalid Argument Was Encountered Windows Firefox We use cookies to operate this website improve its usability imapp an invalid argument was encountered and track visits Please note that by using this site you are consenting to the use an invalid argument was encountered mfc of cookies Learn More Don't show this message

error mount /dev/md0 invalid argument

error mount dev md invalid argument p last updated November in File system Linux TroubleshootingWhen I run the following command at shell prompt on Debian or Ubuntu Linux center p mdadm -Ac partitions dev md wrong fs type bad option bad superblock on dev md -m devI'm getting the message warning that read as follows Failed to RUN ARRAY dev md mount mdadm array invalid argument How do I fix this issue How do I rebuild array again on Linux operating mount dev md can t read superblock system using mdadm command This error indicate that the RAID metadata is

error mounting device invalid argument

error mounting device invalid argument p Sign in Pricing Blog Support Search GitHub option form This repository Watch Star Fork docker docker Code Issues Pull requests Projects Wiki Pulse Graphs New issue Error mounting mount error invalid argument dev mapper something Closed simonvc opened this Issue Jan middot comments mount error invalid argument cifs Projects None yet option form Labels None yet option form Milestone No milestone option form Assignees No one assigned participants simonvc commented Mount Error Invalid Argument Jan Stopped a container with Fig Tried to restart it Got Cannot start container ff f a e Error getting

error netlink error invalid argument 22

error netlink error invalid argument p to report a new issue Bug received netlink error Invalid argument with TFC and IPComp Added by Noel Kuntze almost years ago Updated netlink response contains error invalid argument almost years ago Status ClosedStart date Priority NormalDue date Assignee Tobias BrunnerCategory kernelTarget version Affected version Native window api connect Returned An Error Invalid Argument Resolution Fixed Description When I try to connect to my strongSwan responder from the network segment of my netlink error codes FH Fachhochschule the responder sends the initiatro a NO PROP CHOSENerror and shows this in the log KNL received

error on page invalid argument

error on page invalid argument p here for a quick overview of the site Help Center Detailed answers to any questions you might have Meta Discuss the workings and policies of this site About Us invalid argument error in javascript Learn more about Stack Overflow the company Business Learn more about hiring developers x - Javascript Runtime Error Invalid Argument or posting ads with us Stack Overflow Questions Jobs Documentation Tags Users Badges Ask Question x Dismiss Join the Stack Javascript Invalid Argument Exception Overflow Community Stack Overflow is a community of million programmers just like you helping each other

error os 10022an invalid argument was supplied

error os an invalid argument was supplied p udp python file Next message by thread RELEASE python-daemon' version released Messages sorted winerror an invalid argument was supplied by date thread subject Socket error Errno An Invalid Argument Was Supplied author contro opinion wrote When i test an udp py file on python udp server and client in python usr bin env python import socket sys s socket socket socket AF INET socket SOCK DGRAM MAX PORT if sys argv 'server' s bind ' ' PORT print 'Listening at' s getsockname while True data address s recvfrom MAX print 'The client

error os error message invalid argument

error os error message invalid argument p and SafetyAsset NetworkAsset Operations and MaintenanceCommerceOverviewSubscription last os error invalid argument Billing and Revenue ManagementMaster Data Management for CommerceOmnichannel Oserror Errno Invalid Argument CommerceFinanceOverviewAccounting and Financial CloseCollaborative Finance OperationsEnterprise Risk and ComplianceFinancial Planning and python oserror errno invalid argument AnalysisTreasury and Financial Risk ManagementHuman ResourcesOverviewCore Human Resources and PayrollHuman Capital AnalyticsTalent ManagementTime and Attendance ManagementManufacturingOverviewManufacturing NetworkManufacturing OperationsResponsive docker load invalid argument ManufacturingMarketingOverviewMarket with Speed and AgilityUnique Customer ExperiencesReal-Time Customer InsightsR D EngineeringOverviewDesign NetworkDesign OrchestrationProject and Portfolio ManagementSalesOverviewCollaborative Quote to CashSales Force AutomationSales Performance ManagementSelling Through Contact CentersServiceOverviewEfficient Field Service ManagementOmnichannel Customer ServiceTransparent Service

error pooltcpendpoint socket

error pooltcpendpoint socket p here for a quick overview of the site Help Center Detailed answers to any questions you might have Meta Discuss the workings and policies soapui java net socketexception invalid argument create of this site About Us Learn more about Stack Overflow the company Business java net socketexception invalid argument tomcat Learn more about hiring developers or posting ads with us Stack Overflow Questions Jobs Documentation Tags Users Badges Ask java net socketexception invalid argument create tomcat Question x Dismiss Join the Stack Overflow Community Stack Overflow is a community of million programmers just like you helping

error siocsifaddr invalid argument

error siocsifaddr invalid argument p Apps Gapps MX Player Adaway ViPER Android Audio FX Official XDA App All Apps Games XDA Assist ANALYSIS Editorials Opinion Analysis siocsifhwaddr operation not supported Sony IMX Comprehensive Breakdown of the Google Pixel rsquo s Sensor and its siocsifaddr invalid argument ifconfig FeaturesGoogle Assistant Summary What We Know and Don rsquo t Know mdash Try for Yourself Enable on Any Nougat siocsifhwaddr invalid argument ROM Google rsquo s Pixel Exclusitivity Shows Why Carrier Exclusives Suck for ConsumersRenouncing the Nexus Legacy Priced the Pixel into a Battle it May Not WinExploring Andromeda A Look at the

failed with error 22 invalid argument

failed with error invalid argument p Also Known as Tor Hidden Services Subscribe l l FOLLOW US TWITTER GOOGLE FACEBOOK GET UPDATES BY EMAIL Enter your email below to get exclusive access to our best articles and error invalid argument mac tips before everybody else RSS ALL ARTICLES FEATURES ONLY TRIVIA Search How-To Geek error invalid argument zip How To Fix Warning Re-reading the partition table failed with error Invalid argument Error on Linux If you are getting the Mount Error Invalid Argument following error while trying to change the default fat partition on a new drive to another linux

fatal error inserting iwl3945 invalid argument

fatal error inserting iwl invalid argument p Get Kubuntu Get Xubuntu Get Lubuntu Get UbuntuStudio Get Mythbuntu Get Edubuntu Get Ubuntu-GNOME Get UbuntuKylin Ubuntu Code of Conduct Ubuntu Wiki Community Wiki Other Support Launchpad Answers Ubuntu modprobe invalid argument IRC Support AskUbuntu Official Documentation User Documentation Social Media Facebook Twitter Useful Links Distrowatch Insmod Error Could Not Insert Module Invalid Parameters Bugs Ubuntu PPAs Ubuntu Web Upd Ubuntu OMG Ubuntu Ubuntu Insights Planet Ubuntu Activity Page Please read before SSO login Disagrees About Version Of Symbol Advanced Search Forum The Ubuntu Forum Community Ubuntu Official Flavours Support Networking Wireless ubuntu

fatal error inserting snd_hda_intel invalid argument

fatal error inserting snd hda intel invalid argument p load the snd-hda-intel module any more My Ubuntu version is The modprobe invalid argument current kernel is uname -a Linux bledart - -generic Insmod Error Could Not Insert Module Invalid Parameters -Ubuntu SMP Mon Mar UTC i i i GNU Linux sound works disagrees about version of symbol fine with - Maybe the problem is that there exists no linux-alsa-driver-modules- - -generic package yet Here is the output when I want to load the module sudo modprobe -v snd-hda-intel insmod lib modules - -generic updates dkms snd-hda-codec ko WARNING Error inserting

g-io-error-quark 0

G-io-error-quark p communities company blog Stack Exchange Inbox Reputation and Badges sign up log in tour help Tour Start here for a quick overview of the site Help Center Detailed answers to any questions you might have Meta Discuss the workings and policies invalid argument g-io-error-quark of this site About Us Learn more about Stack Overflow the company Udisks-error-quark Business Learn more about hiring developers or posting ads with us Ask Ubuntu Questions Tags Users Badges Unanswered Ask Question Error Allocating Space For Disk Image File Invalid Argument g-io-error-quark Ask Ubuntu is a question and answer site for Ubuntu users

getsockname error 10022

Getsockname Error p here for a quick overview of the site Help Center Detailed answers to any questions Socket error Errno Invalid Argument Python you might have Meta Discuss the workings and policies of this socket error errno an invalid argument was supplied site About Us Learn more about Stack Overflow the company Business Learn more about hiring developers socket error invalid argument or posting ads with us Stack Overflow Questions Jobs Documentation Tags Users Badges Ask Question x Dismiss Join the Stack Overflow Community Stack Overflow is a community Python Winerror of million programmers just like you helping each

git fatal write error invalid argument

Git Fatal Write Error Invalid Argument p here for a quick overview of the site Help Center Detailed answers to any questions you might have Meta Discuss the workings and policies of this site About Us Learn more about Stack Overflow the company Git Fetch Fatal Write Error Invalid Argument Business Learn more about hiring developers or posting ads with us Stack Overflow Questions Jobs git push fatal write error invalid argument Documentation Tags Users Badges Ask Question x Dismiss Join the Stack Overflow Community Stack Overflow is a community of million programmers git clone fatal write error just like

grep write error invalid argument

Grep Write Error Invalid Argument p commands in Windows cmd exe you may encounter strange error messages like this ls grep x ls write error Invalid argument The first command reports a write error but the linux echo write error invalid argument error is really in the second command after the pipe symbol You may Echo Write To Failed Invalid Argument also encounter a similar write error if the wrong command is found in your PATH variable For instance Windows Echo Ds x sys class i c-adapter i c- new device Bash Echo Write Error Invalid Argument and GnuWin both